Subject: [Geotools-devel] Build failed in Jenkins:
geotools-master-online-postgis #305



See
<http://ares.boundlessgeo.com/jenkins/job/geotools-master-online-postgis/305/changes>

Changes:

[jeroen.dries] GEOT-5773 avoid NPE in GridCoverageRenderer when colormodel is
null.

[schulz.johng] Fixed test to remove '' from true false assertions

------------------------------------------
[...truncated 19012 lines...]
at
org.apache.maven.surefire.booter.ForkedBooter.runSuitesInProcess(ForkedBooter.java:153)
at
org.apache.maven.surefire.booter.ForkedBooter.main(ForkedBooter.java:103)
Caused by: org.apache.commons.dbcp.SQLNestedException: Cannot create JDBC
driver of class 'org.sqlite.JDBC' for connect URL 'null'
at
org.apache.commons.dbcp.BasicDataSource.createConnectionFactory(BasicDataSource.java:1452)
at
org.apache.commons.dbcp.BasicDataSource.createDataSource(BasicDataSource.java:1371)
at
org.apache.commons.dbcp.BasicDataSource.getConnection(BasicDataSource.java:1044)
at
org.geotools.data.jdbc.datasource.AbstractManageableDataSource.getConnection(AbstractManageableDataSource.java:48)
at org.geotools.jdbc.JDBCTestSupport.isOnline(JDBCTestSupport.java:101)
... 11 more
Caused by: java.sql.SQLException: No suitable driver
at java.sql.DriverManager.getDriver(DriverManager.java:315)
at
org.apache.commons.dbcp.BasicDataSource.createConnectionFactory(BasicDataSource.java:1437)
... 15 more
Tests run: 0, Failures: 0, Errors: 0, Skipped: 0, Time elapsed: 0.036 sec - in
org.geotools.geopkg.GeoPkgBooleanOnlineTest
Running org.geotools.geopkg.GeoPkgDataStoreAPITest
Tests run: 1, Failures: 0, Errors: 0, Skipped: 0, Time elapsed: 2.464 sec - in
org.geotools.geopkg.GeoPkgDataStoreAPITest
Running org.geotools.geopkg.GeoPkgDataStoreFactoryTest
Tests run: 1, Failures: 0, Errors: 0, Skipped: 0, Time elapsed: 2.428 sec - in
org.geotools.geopkg.GeoPkgDataStoreFactoryTest
Running org.geotools.geopkg.GeoPkgDataStoreOnlineTest
Tests run: 0, Failures: 0, Errors: 0, Skipped: 0, Time elapsed: 0.003 sec - in
org.geotools.geopkg.GeoPkgDataStoreOnlineTest
Running org.geotools.geopkg.GeoPkgDateOnlineTest
Tests run: 0, Failures: 0, Errors: 0, Skipped: 0, Time elapsed: 0.003 sec - in
org.geotools.geopkg.GeoPkgDateOnlineTest
Running org.geotools.geopkg.GeoPkgEmptyGeometryOnlineTest
Tests run: 0, Failures: 0, Errors: 0, Skipped: 0, Time elapsed: 0.003 sec - in
org.geotools.geopkg.GeoPkgEmptyGeometryOnlineTest
Running org.geotools.geopkg.GeoPkgFeatureCollectionOnlineTest
Tests run: 0, Failures: 0, Errors: 0, Skipped: 0, Time elapsed: 0.002 sec - in
org.geotools.geopkg.GeoPkgFeatureCollectionOnlineTest
Running org.geotools.geopkg.GeoPkgFeatureLockingOnlineTest
Tests run: 0, Failures: 0, Errors: 0, Skipped: 0, Time elapsed: 0.003 sec - in
org.geotools.geopkg.GeoPkgFeatureLockingOnlineTest
Running org.geotools.geopkg.GeoPkgFeatureReaderOnlineTest
Tests run: 0, Failures: 0, Errors: 0, Skipped: 0, Time elapsed: 0 sec - in
org.geotools.geopkg.GeoPkgFeatureReaderOnlineTest
Running org.geotools.geopkg.GeoPkgFeatureSourceOnlineTest
Tests run: 0, Failures: 0, Errors: 0, Skipped: 0, Time elapsed: 0.005 sec - in
org.geotools.geopkg.GeoPkgFeatureSourceOnlineTest
Running org.geotools.geopkg.GeoPkgFeatureStoreOnlineTest
Tests run: 0, Failures: 0, Errors: 0, Skipped: 0, Time elapsed: 0.003 sec - in
org.geotools.geopkg.GeoPkgFeatureStoreOnlineTest
Running org.geotools.geopkg.GeoPkgGeometryOnlineTest
Tests run: 0, Failures: 0, Errors: 0, Skipped: 0, Time elapsed: 0.002 sec - in
org.geotools.geopkg.GeoPkgGeometryOnlineTest
Running org.geotools.geopkg.GeoPkgGeometrylessOnlineTest
Tests run: 0, Failures: 0, Errors: 0, Skipped: 0, Time elapsed: 0.002 sec - in
org.geotools.geopkg.GeoPkgGeometrylessOnlineTest
Running org.geotools.geopkg.GeoPkgNoPrimaryKeyOnlineTest
Tests run: 0, Failures: 0, Errors: 0, Skipped: 0, Time elapsed: 0.002 sec - in
org.geotools.geopkg.GeoPkgNoPrimaryKeyOnlineTest
Running org.geotools.geopkg.GeoPkgPrimaryKeyFinderOnlineTest
Tests run: 0, Failures: 0, Errors: 0, Skipped: 0, Time elapsed: 0.001 sec - in
org.geotools.geopkg.GeoPkgPrimaryKeyFinderOnlineTest
Running org.geotools.geopkg.GeoPkgPrimaryKeyOnlineTest
Tests run: 0, Failures: 0, Errors: 0, Skipped: 0, Time elapsed: 0.003 sec - in
org.geotools.geopkg.GeoPkgPrimaryKeyOnlineTest
Running org.geotools.geopkg.GeoPkgSpatialFiltersOnlineTest
Tests run: 0, Failures: 0, Errors: 0, Skipped: 0, Time elapsed: 0.004 sec - in
org.geotools.geopkg.GeoPkgSpatialFiltersOnlineTest
Running org.geotools.geopkg.GeoPkgTypeNamesOnlineTest
Tests run: 0, Failures: 0, Errors: 0, Skipped: 0, Time elapsed: 0.001 sec - in
org.geotools.geopkg.GeoPkgTypeNamesOnlineTest
Running org.geotools.geopkg.GeoPkgViewOnlineTest
Tests run: 0, Failures: 0, Errors: 0, Skipped: 0, Time elapsed: 0.002 sec - in
org.geotools.geopkg.GeoPkgViewOnlineTest
Running org.geotools.geopkg.geom.GeoPkgIOTest
Tests run: 2, Failures: 0, Errors: 0, Skipped: 0, Time elapsed: 0.046 sec - in
org.geotools.geopkg.geom.GeoPkgIOTest
Running org.geotools.geopkg.mosaic.GeoPackageReaderTest
Tests run: 5, Failures: 0, Errors: 0, Skipped: 0, Time elapsed: 0.787 sec - in
org.geotools.geopkg.mosaic.GeoPackageReaderTest
Running org.geotools.geopkg.wps.xml.BboxtypeBindingTest
Tests run: 3, Failures: 0, Errors: 0, Skipped: 0, Time elapsed: 3.698 sec - in
org.geotools.geopkg.wps.xml.BboxtypeBindingTest
Running org.geotools.geopkg.wps.xml.CoveragetypeBindingTest
Tests run: 3, Failures: 0, Errors: 0, Skipped: 0, Time elapsed: 0.015 sec - in
org.geotools.geopkg.wps.xml.CoveragetypeBindingTest
Running org.geotools.geopkg.wps.xml.GeopkgtypeBindingTest
Tests run: 3, Failures: 0, Errors: 0, Skipped: 0, Time elapsed: 0.038 sec - in
org.geotools.geopkg.wps.xml.GeopkgtypeBindingTest
Running org.geotools.geopkg.wps.xml.Geopkgtype_featuresBindingTest
Tests run: 2, Failures: 0, Errors: 0, Skipped: 0, Time elapsed: 0.003 sec - in
org.geotools.geopkg.wps.xml.Geopkgtype_featuresBindingTest
Running org.geotools.geopkg.wps.xml.Geopkgtype_tilesBindingTest
Tests run: 2, Failures: 0, Errors: 0, Skipped: 0, Time elapsed: 0.004 sec - in
org.geotools.geopkg.wps.xml.Geopkgtype_tilesBindingTest
Running org.geotools.geopkg.wps.xml.GridsettypeBindingTest
Tests run: 2, Failures: 0, Errors: 0, Skipped: 0, Time elapsed: 0.004 sec - in
org.geotools.geopkg.wps.xml.GridsettypeBindingTest
Running org.geotools.geopkg.wps.xml.Gridsettype_gridsBindingTest
Tests run: 2, Failures: 0, Errors: 0, Skipped: 0, Time elapsed: 0.004 sec - in
org.geotools.geopkg.wps.xml.Gridsettype_gridsBindingTest
Running org.geotools.geopkg.wps.xml.GridtypeBindingTest
Tests run: 3, Failures: 0, Errors: 0, Skipped: 0, Time elapsed: 0.013 sec - in
org.geotools.geopkg.wps.xml.GridtypeBindingTest

Results :

Tests run: 43, Failures: 0, Errors: 0, Skipped: 0

[INFO]
[INFO] --- maven-jar-plugin:2.4:jar (default-jar) @ gt-geopkg ---
[INFO] Building jar:
<http://ares.boundlessgeo.com/jenkins/job/geotools-master-online-postgis/ws/modules/plugin/geopkg/target/gt-geopkg-18-SNAPSHOT.jar>
[INFO]
[INFO] >>> maven-source-plugin:2.2.1:jar (attach-sources) > generate-sources @
gt-geopkg >>>
[INFO]
[INFO] --- git-commit-id-plugin:2.1.2:revision (default) @ gt-geopkg ---
[INFO]
[INFO] <<< maven-source-plugin:2.2.1:jar (attach-sources) < generate-sources @
gt-geopkg <<<
[INFO]
[INFO] --- maven-source-plugin:2.2.1:jar (attach-sources) @ gt-geopkg ---
[INFO] Building jar:
<http://ares.boundlessgeo.com/jenkins/job/geotools-master-online-postgis/ws/modules/plugin/geopkg/target/gt-geopkg-18-SNAPSHOT-sources.jar>
[INFO]
[INFO] --- maven-install-plugin:2.4:install (default-install) @ gt-geopkg ---
[INFO] Installing
<http://ares.boundlessgeo.com/jenkins/job/geotools-master-online-postgis/ws/modules/plugin/geopkg/target/gt-geopkg-18-SNAPSHOT.jar>
to
/var/lib/jenkins/.m2/repository/org/geotools/gt-geopkg/18-SNAPSHOT/gt-geopkg-18-SNAPSHOT.jar
[INFO] Installing
<http://ares.boundlessgeo.com/jenkins/job/geotools-master-online-postgis/ws/modules/plugin/geopkg/pom.xml>
to
/var/lib/jenkins/.m2/repository/org/geotools/gt-geopkg/18-SNAPSHOT/gt-geopkg-18-SNAPSHOT.pom
[INFO] Installing
<http://ares.boundlessgeo.com/jenkins/job/geotools-master-online-postgis/ws/modules/plugin/geopkg/target/gt-geopkg-18-SNAPSHOT-sources.jar>
to
/var/lib/jenkins/.m2/repository/org/geotools/gt-geopkg/18-SNAPSHOT/gt-geopkg-18-SNAPSHOT-sources.jar
[INFO]
[INFO] ------------------------------------------------------------------------
[INFO] Skipping Application Schema DataAccess
[INFO] This project has been banned from the build due to previous failures.
[INFO] ------------------------------------------------------------------------
[INFO]
[INFO] ------------------------------------------------------------------------
[INFO] Skipping Validation Processor and Framework
[INFO] This project has been banned from the build due to previous failures.
[INFO] ------------------------------------------------------------------------
[INFO]
[INFO] ------------------------------------------------------------------------
[INFO] Building MBTiles Module 18-SNAPSHOT
[INFO] ------------------------------------------------------------------------
[INFO]
[INFO] --- maven-clean-plugin:2.5:clean (default-clean) @ gt-mbtiles ---
[INFO] Deleting
<http://ares.boundlessgeo.com/jenkins/job/geotools-master-online-postgis/ws/modules/unsupported/mbtiles/target>
[INFO]
[INFO] --- git-commit-id-plugin:2.1.2:revision (default) @ gt-mbtiles ---
[INFO]
[INFO] --- maven-resources-plugin:2.6:resources (default-resources) @
gt-mbtiles ---
[INFO] Using 'UTF-8' encoding to copy filtered resources.
[INFO] Copying 2 resources
[INFO]
[INFO] --- maven-compiler-plugin:3.1:compile (default-compile) @ gt-mbtiles ---
[INFO] Changes detected - recompiling the module!
[INFO] Compiling 9 source files to
<http://ares.boundlessgeo.com/jenkins/job/geotools-master-online-postgis/ws/modules/unsupported/mbtiles/target/classes>
[INFO]
[INFO] --- maven-resources-plugin:2.6:testResources (default-testResources) @
gt-mbtiles ---
[INFO] Using 'UTF-8' encoding to copy filtered resources.
[INFO] Copying 5 resources
[INFO]
[INFO] --- maven-compiler-plugin:3.1:testCompile (default-testCompile) @
gt-mbtiles ---
[INFO] Changes detected - recompiling the module!
[INFO] Compiling 3 source files to
<http://ares.boundlessgeo.com/jenkins/job/geotools-master-online-postgis/ws/modules/unsupported/mbtiles/target/test-classes>
[INFO]
[INFO] --- maven-surefire-plugin:2.15:test (default-test) @ gt-mbtiles ---
[INFO] Surefire report directory:
<http://ares.boundlessgeo.com/jenkins/job/geotools-master-online-postgis/ws/modules/unsupported/mbtiles/target/surefire-reports>

-------------------------------------------------------
T E S T S
-------------------------------------------------------
Running org.geotools.mbtiles.MBTilesFileTest
Tests run: 6, Failures: 0, Errors: 0, Skipped: 0, Time elapsed: 9.552 sec - in
org.geotools.mbtiles.MBTilesFileTest
Running org.geotools.mbtiles.MBTilesFileVectorTileTest
Tests run: 2, Failures: 0, Errors: 0, Skipped: 0, Time elapsed: 0.038 sec - in
org.geotools.mbtiles.MBTilesFileVectorTileTest
Running org.geotools.mbtiles.mosaic.MBTilesReaderTest
Tests run: 3, Failures: 0, Errors: 0, Skipped: 0, Time elapsed: 0.892 sec - in
org.geotools.mbtiles.mosaic.MBTilesReaderTest

Results :

Tests run: 11, Failures: 0, Errors: 0, Skipped: 0

[INFO]
[INFO] --- maven-jar-plugin:2.4:jar (default-jar) @ gt-mbtiles ---
[INFO] Building jar:
<http://ares.boundlessgeo.com/jenkins/job/geotools-master-online-postgis/ws/modules/unsupported/mbtiles/target/gt-mbtiles-18-SNAPSHOT.jar>
[INFO]
[INFO] --- maven-jar-plugin:2.4:test-jar (default) @ gt-mbtiles ---
[INFO] Building jar:
<http://ares.boundlessgeo.com/jenkins/job/geotools-master-online-postgis/ws/modules/unsupported/mbtiles/target/gt-mbtiles-18-SNAPSHOT-tests.jar>
[INFO]
[INFO] >>> maven-source-plugin:2.2.1:jar (attach-sources) > generate-sources @
gt-mbtiles >>>
[INFO]
[INFO] --- git-commit-id-plugin:2.1.2:revision (default) @ gt-mbtiles ---
[INFO]
[INFO] <<< maven-source-plugin:2.2.1:jar (attach-sources) < generate-sources @
gt-mbtiles <<<
[INFO]
[INFO] --- maven-source-plugin:2.2.1:jar (attach-sources) @ gt-mbtiles ---
[INFO] Building jar:
<http://ares.boundlessgeo.com/jenkins/job/geotools-master-online-postgis/ws/modules/unsupported/mbtiles/target/gt-mbtiles-18-SNAPSHOT-sources.jar>
[INFO]
[INFO] --- maven-install-plugin:2.4:install (default-install) @ gt-mbtiles ---
[INFO] Installing
<http://ares.boundlessgeo.com/jenkins/job/geotools-master-online-postgis/ws/modules/unsupported/mbtiles/target/gt-mbtiles-18-SNAPSHOT.jar>
to
/var/lib/jenkins/.m2/repository/org/geotools/gt-mbtiles/18-SNAPSHOT/gt-mbtiles-18-SNAPSHOT.jar
[INFO] Installing
<http://ares.boundlessgeo.com/jenkins/job/geotools-master-online-postgis/ws/modules/unsupported/mbtiles/pom.xml>
to
/var/lib/jenkins/.m2/repository/org/geotools/gt-mbtiles/18-SNAPSHOT/gt-mbtiles-18-SNAPSHOT.pom
[INFO] Installing
<http://ares.boundlessgeo.com/jenkins/job/geotools-master-online-postgis/ws/modules/unsupported/mbtiles/target/gt-mbtiles-18-SNAPSHOT-tests.jar>
to
/var/lib/jenkins/.m2/repository/org/geotools/gt-mbtiles/18-SNAPSHOT/gt-mbtiles-18-SNAPSHOT-tests.jar
[INFO] Installing
<http://ares.boundlessgeo.com/jenkins/job/geotools-master-online-postgis/ws/modules/unsupported/mbtiles/target/gt-mbtiles-18-SNAPSHOT-sources.jar>
to
/var/lib/jenkins/.m2/repository/org/geotools/gt-mbtiles/18-SNAPSHOT/gt-mbtiles-18-SNAPSHOT-sources.jar
[INFO]
[INFO] ------------------------------------------------------------------------
[INFO] Skipping Web Processing Service
[INFO] This project has been banned from the build due to previous failures.
[INFO] ------------------------------------------------------------------------
[INFO]
[INFO] ------------------------------------------------------------------------
[INFO] Building Next Generation JDBC DataStores 18-SNAPSHOT
[INFO] ------------------------------------------------------------------------
[INFO]
[INFO] --- maven-clean-plugin:2.5:clean (default-clean) @ gt-jdbc-ng ---
[INFO]
[INFO] --- git-commit-id-plugin:2.1.2:revision (default) @ gt-jdbc-ng ---
[INFO]
[INFO] >>> maven-source-plugin:2.2.1:jar (attach-sources) > generate-sources @
gt-jdbc-ng >>>
[INFO]
[INFO] --- git-commit-id-plugin:2.1.2:revision (default) @ gt-jdbc-ng ---
[INFO]
[INFO] <<< maven-source-plugin:2.2.1:jar (attach-sources) < generate-sources @
gt-jdbc-ng <<<
[INFO]
[INFO] --- maven-source-plugin:2.2.1:jar (attach-sources) @ gt-jdbc-ng ---
[INFO]
[INFO] --- maven-install-plugin:2.4:install (default-install) @ gt-jdbc-ng ---
[INFO] Installing
<http://ares.boundlessgeo.com/jenkins/job/geotools-master-online-postgis/ws/modules/unsupported/jdbc-ng/pom.xml>
to
/var/lib/jenkins/.m2/repository/org/geotools/gt-jdbc-ng/18-SNAPSHOT/gt-jdbc-ng-18-SNAPSHOT.pom
[INFO]
[INFO] ------------------------------------------------------------------------
[INFO] Skipping MongoDB DataStore
[INFO] This project has been banned from the build due to previous failures.
[INFO] ------------------------------------------------------------------------
[INFO]
[INFO] ------------------------------------------------------------------------
[INFO] Skipping GeoTools Documentation
[INFO] This project has been banned from the build due to previous failures.
[INFO] ------------------------------------------------------------------------
[INFO] ------------------------------------------------------------------------
[INFO] Reactor Summary:
[INFO]
[INFO] JDBC DataStore Support ............................. SUCCESS [ 13.335 s]
[INFO] ArcSDE DataStore plugin ............................ SUCCESS [ 9.901 s]
[INFO] JDBC DataStore Plugins ............................. SUCCESS [ 0.094 s]
[INFO] H2 DataStore ....................................... SUCCESS [ 42.022 s]
[INFO] Oracle DataStore ................................... SUCCESS [ 4.698 s]
[INFO] PostGIS DataStore .................................. FAILURE [11:11 min]
[INFO] imagemosaic datasource module ...................... SKIPPED
[INFO] imagepyramid datasource module ..................... SKIPPED
[INFO] imagemosaic-jdbc module ............................ SUCCESS [ 13.936 s]
[INFO] DB2 DataStore ...................................... SUCCESS [ 4.694 s]
[INFO] MySQL DataStore .................................... SUCCESS [ 3.662 s]
[INFO] SQL Server DataStore ............................... SUCCESS [ 4.932 s]
[INFO] SpatiaLite DataStore ............................... SUCCESS [ 4.214 s]
[INFO] Teradata DataStore ................................. SUCCESS [ 4.401 s]
[INFO] API interfaces ..................................... SKIPPED
[INFO] NetCDF gridcoverage module ......................... SKIPPED
[INFO] GRIB gridcoverage module ........................... SKIPPED
[INFO] GeoPackage Module .................................. SUCCESS [ 56.307 s]
[INFO] Application Schema DataAccess ...................... SKIPPED
[INFO] Validation Processor and Framework ................. SKIPPED
[INFO] MBTiles Module ..................................... SUCCESS [ 14.432 s]
[INFO] Web Processing Service ............................. SKIPPED
[INFO] Next Generation JDBC DataStores .................... SUCCESS [ 0.091 s]
[INFO] MongoDB DataStore .................................. SKIPPED
[INFO] GeoTools Documentation ............................. SKIPPED
[INFO] ------------------------------------------------------------------------
[INFO] BUILD FAILURE
[INFO] ------------------------------------------------------------------------
[INFO] Total time: 14:12 min
[INFO] Finished at: 2017-08-01T01:23:01+00:00
[INFO] Final Memory: 72M/547M
[INFO] ------------------------------------------------------------------------
[ERROR] Failed to execute goal
org.apache.maven.plugins:maven-surefire-plugin:2.15:test (default-test) on
project gt-jdbc-postgis: There are test failures.
[ERROR]
[ERROR] Please refer to
<http://ares.boundlessgeo.com/jenkins/job/geotools-master-online-postgis/ws/modules/plugin/jdbc/jdbc-postgis/target/surefire-reports>
for the individual test results.
[ERROR] -> [Help 1]
[ERROR]
[ERROR] To see the full stack trace of the errors, re-run Maven with the -e
switch.
[ERROR] Re-run Maven using the -X switch to enable full debug logging.
[ERROR]
[ERROR] For more information about the errors and possible solutions, please
read the following articles:
[ERROR] [Help 1]
http://cwiki.apache.org/confluence/display/MAVEN/MojoFailureException
[ERROR]
[ERROR] After correcting the problems, you can resume the build with the command
[ERROR] mvn <goals> -rf :gt-jdbc-postgis
Build step 'Invoke top-level Maven targets' marked build as failure

------------------------------------------------------------------------------
Check out the vibrant tech community on one of the world's most
engaging tech sites, Slashdot.org! http://sdm.link/slashdot
_______________________________________________
GeoTools-Devel mailing list
[email protected]
https://lists.sourceforge.net/lists/listinfo/geotools-devel



Programming list archiving by: Enterprise Git Hosting