Subject: [JENKINS] Lucene-Solr-Tests-7.x - Build # 138 -
Unstable



Build: https://builds.apache.org/job/Lucene-Solr-Tests-7.x/138/

2 tests failed.
FAILED: org.apache.solr.update.AutoCommitTest.testMaxDocs

Error Message:
Exception during query

Stack Trace:
java.lang.RuntimeException: Exception during query
at
__randomizedtesting.SeedInfo.seed([B678C8412043B0BF:FF91E9E0CA9B435]:0)
at org.apache.solr.SolrTestCaseJ4.assertQ(SolrTestCaseJ4.java:886)
at
org.apache.solr.update.AutoCommitTest.testMaxDocs(AutoCommitTest.java:225)
at sun.reflect.NativeMethodAccessorImpl.invoke0(Native Method)
at
sun.reflect.NativeMethodAccessorImpl.invoke(NativeMethodAccessorImpl.java:62)
at
sun.reflect.DelegatingMethodAccessorImpl.invoke(DelegatingMethodAccessorImpl.java:43)
at java.lang.reflect.Method.invoke(Method.java:498)
at
com.carrotsearch.randomizedtesting.RandomizedRunner.invoke(RandomizedRunner.java:1713)
at
com.carrotsearch.randomizedtesting.RandomizedRunner$8.evaluate(RandomizedRunner.java:907)
at
com.carrotsearch.randomizedtesting.RandomizedRunner$9.evaluate(RandomizedRunner.java:943)
at
com.carrotsearch.randomizedtesting.RandomizedRunner$10.evaluate(RandomizedRunner.java:957)
at
com.carrotsearch.randomizedtesting.rules.SystemPropertiesRestoreRule$1.evaluate(SystemPropertiesRestoreRule.java:57)
at
org.apache.lucene.util.TestRuleSetupTeardownChained$1.evaluate(TestRuleSetupTeardownChained.java:49)
at
org.apache.lucene.util.AbstractBeforeAfterRule$1.evaluate(AbstractBeforeAfterRule.java:45)
at
org.apache.lucene.util.TestRuleThreadAndTestName$1.evaluate(TestRuleThreadAndTestName.java:48)
at
org.apache.lucene.util.TestRuleIgnoreAfterMaxFailures$1.evaluate(TestRuleIgnoreAfterMaxFailures.java:64)
at
org.apache.lucene.util.TestRuleMarkFailure$1.evaluate(TestRuleMarkFailure.java:47)
at
com.carrotsearch.randomizedtesting.rules.StatementAdapter.evaluate(StatementAdapter.java:36)
at
com.carrotsearch.randomizedtesting.ThreadLeakControl$StatementRunner.run(ThreadLeakControl.java:368)
at
com.carrotsearch.randomizedtesting.ThreadLeakControl.forkTimeoutingTask(ThreadLeakControl.java:817)
at
com.carrotsearch.randomizedtesting.ThreadLeakControl$3.evaluate(ThreadLeakControl.java:468)
at
com.carrotsearch.randomizedtesting.RandomizedRunner.runSingleTest(RandomizedRunner.java:916)
at
com.carrotsearch.randomizedtesting.RandomizedRunner$5.evaluate(RandomizedRunner.java:802)
at
com.carrotsearch.randomizedtesting.RandomizedRunner$6.evaluate(RandomizedRunner.java:852)
at
com.carrotsearch.randomizedtesting.RandomizedRunner$7.evaluate(RandomizedRunner.java:863)
at
com.carrotsearch.randomizedtesting.rules.StatementAdapter.evaluate(StatementAdapter.java:36)
at
com.carrotsearch.randomizedtesting.rules.SystemPropertiesRestoreRule$1.evaluate(SystemPropertiesRestoreRule.java:57)
at
org.apache.lucene.util.AbstractBeforeAfterRule$1.evaluate(AbstractBeforeAfterRule.java:45)
at
com.carrotsearch.randomizedtesting.rules.StatementAdapter.evaluate(StatementAdapter.java:36)
at
org.apache.lucene.util.TestRuleStoreClassName$1.evaluate(TestRuleStoreClassName.java:41)
at
com.carrotsearch.randomizedtesting.rules.NoShadowingOrOverridesOnMethodsRule$1.evaluate(NoShadowingOrOverridesOnMethodsRule.java:40)
at
com.carrotsearch.randomizedtesting.rules.NoShadowingOrOverridesOnMethodsRule$1.evaluate(NoShadowingOrOverridesOnMethodsRule.java:40)
at
com.carrotsearch.randomizedtesting.rules.StatementAdapter.evaluate(StatementAdapter.java:36)
at
com.carrotsearch.randomizedtesting.rules.StatementAdapter.evaluate(StatementAdapter.java:36)
at
com.carrotsearch.randomizedtesting.rules.StatementAdapter.evaluate(StatementAdapter.java:36)
at
org.apache.lucene.util.TestRuleAssertionsRequired$1.evaluate(TestRuleAssertionsRequired.java:53)
at
org.apache.lucene.util.TestRuleMarkFailure$1.evaluate(TestRuleMarkFailure.java:47)
at
org.apache.lucene.util.TestRuleIgnoreAfterMaxFailures$1.evaluate(TestRuleIgnoreAfterMaxFailures.java:64)
at
org.apache.lucene.util.TestRuleIgnoreTestSuites$1.evaluate(TestRuleIgnoreTestSuites.java:54)
at
com.carrotsearch.randomizedtesting.rules.StatementAdapter.evaluate(StatementAdapter.java:36)
at
com.carrotsearch.randomizedtesting.ThreadLeakControl$StatementRunner.run(ThreadLeakControl.java:368)
at java.lang.Thread.run(Thread.java:748)
Caused by: java.lang.RuntimeException: REQUEST FAILED:
xpath=//result[@numFound=1]
xml response was: <?xml version="1.0" encoding="UTF-8"?>
<response>
<lst name="responseHeader"><int name="status">0</int><int
name="QTime">0</int></lst><result name="response" numFound="0"
start="0"></result>
</response>

request was:q=id:14&qt=&start=0&rows=20&version=2.2
at org.apache.solr.SolrTestCaseJ4.assertQ(SolrTestCaseJ4.java:879)
... 40 more


FAILED: org.apache.solr.update.AutoCommitTest.testMaxTime

Error Message:
Exception during query

Stack Trace:
java.lang.RuntimeException: Exception during query
at
__randomizedtesting.SeedInfo.seed([B678C8412043B0BF:2C8CB5A3BED92C83]:0)
at org.apache.solr.SolrTestCaseJ4.assertQ(SolrTestCaseJ4.java:886)
at
org.apache.solr.update.AutoCommitTest.testMaxTime(AutoCommitTest.java:270)
at sun.reflect.NativeMethodAccessorImpl.invoke0(Native Method)
at
sun.reflect.NativeMethodAccessorImpl.invoke(NativeMethodAccessorImpl.java:62)
at
sun.reflect.DelegatingMethodAccessorImpl.invoke(DelegatingMethodAccessorImpl.java:43)
at java.lang.reflect.Method.invoke(Method.java:498)
at
com.carrotsearch.randomizedtesting.RandomizedRunner.invoke(RandomizedRunner.java:1713)
at
com.carrotsearch.randomizedtesting.RandomizedRunner$8.evaluate(RandomizedRunner.java:907)
at
com.carrotsearch.randomizedtesting.RandomizedRunner$9.evaluate(RandomizedRunner.java:943)
at
com.carrotsearch.randomizedtesting.RandomizedRunner$10.evaluate(RandomizedRunner.java:957)
at
com.carrotsearch.randomizedtesting.rules.SystemPropertiesRestoreRule$1.evaluate(SystemPropertiesRestoreRule.java:57)
at
org.apache.lucene.util.TestRuleSetupTeardownChained$1.evaluate(TestRuleSetupTeardownChained.java:49)
at
org.apache.lucene.util.AbstractBeforeAfterRule$1.evaluate(AbstractBeforeAfterRule.java:45)
at
org.apache.lucene.util.TestRuleThreadAndTestName$1.evaluate(TestRuleThreadAndTestName.java:48)
at
org.apache.lucene.util.TestRuleIgnoreAfterMaxFailures$1.evaluate(TestRuleIgnoreAfterMaxFailures.java:64)
at
org.apache.lucene.util.TestRuleMarkFailure$1.evaluate(TestRuleMarkFailure.java:47)
at
com.carrotsearch.randomizedtesting.rules.StatementAdapter.evaluate(StatementAdapter.java:36)
at
com.carrotsearch.randomizedtesting.ThreadLeakControl$StatementRunner.run(ThreadLeakControl.java:368)
at
com.carrotsearch.randomizedtesting.ThreadLeakControl.forkTimeoutingTask(ThreadLeakControl.java:817)
at
com.carrotsearch.randomizedtesting.ThreadLeakControl$3.evaluate(ThreadLeakControl.java:468)
at
com.carrotsearch.randomizedtesting.RandomizedRunner.runSingleTest(RandomizedRunner.java:916)
at
com.carrotsearch.randomizedtesting.RandomizedRunner$5.evaluate(RandomizedRunner.java:802)
at
com.carrotsearch.randomizedtesting.RandomizedRunner$6.evaluate(RandomizedRunner.java:852)
at
com.carrotsearch.randomizedtesting.RandomizedRunner$7.evaluate(RandomizedRunner.java:863)
at
com.carrotsearch.randomizedtesting.rules.StatementAdapter.evaluate(StatementAdapter.java:36)
at
com.carrotsearch.randomizedtesting.rules.SystemPropertiesRestoreRule$1.evaluate(SystemPropertiesRestoreRule.java:57)
at
org.apache.lucene.util.AbstractBeforeAfterRule$1.evaluate(AbstractBeforeAfterRule.java:45)
at
com.carrotsearch.randomizedtesting.rules.StatementAdapter.evaluate(StatementAdapter.java:36)
at
org.apache.lucene.util.TestRuleStoreClassName$1.evaluate(TestRuleStoreClassName.java:41)
at
com.carrotsearch.randomizedtesting.rules.NoShadowingOrOverridesOnMethodsRule$1.evaluate(NoShadowingOrOverridesOnMethodsRule.java:40)
at
com.carrotsearch.randomizedtesting.rules.NoShadowingOrOverridesOnMethodsRule$1.evaluate(NoShadowingOrOverridesOnMethodsRule.java:40)
at
com.carrotsearch.randomizedtesting.rules.StatementAdapter.evaluate(StatementAdapter.java:36)
at
com.carrotsearch.randomizedtesting.rules.StatementAdapter.evaluate(StatementAdapter.java:36)
at
com.carrotsearch.randomizedtesting.rules.StatementAdapter.evaluate(StatementAdapter.java:36)
at
org.apache.lucene.util.TestRuleAssertionsRequired$1.evaluate(TestRuleAssertionsRequired.java:53)
at
org.apache.lucene.util.TestRuleMarkFailure$1.evaluate(TestRuleMarkFailure.java:47)
at
org.apache.lucene.util.TestRuleIgnoreAfterMaxFailures$1.evaluate(TestRuleIgnoreAfterMaxFailures.java:64)
at
org.apache.lucene.util.TestRuleIgnoreTestSuites$1.evaluate(TestRuleIgnoreTestSuites.java:54)
at
com.carrotsearch.randomizedtesting.rules.StatementAdapter.evaluate(StatementAdapter.java:36)
at
com.carrotsearch.randomizedtesting.ThreadLeakControl$StatementRunner.run(ThreadLeakControl.java:368)
at java.lang.Thread.run(Thread.java:748)
Caused by: java.lang.RuntimeException: REQUEST FAILED:
xpath=//result[@numFound=1]
xml response was: <?xml version="1.0" encoding="UTF-8"?>
<response>
<lst name="responseHeader"><int name="status">0</int><int
name="QTime">0</int></lst><result name="response" numFound="0"
start="0"></result>
</response>

request was:q=id:529&qt=&start=0&rows=20&version=2.2
at org.apache.solr.SolrTestCaseJ4.assertQ(SolrTestCaseJ4.java:879)
... 40 more




Build Log:
[...truncated 11437 lines...]
[junit4] Suite: org.apache.solr.update.AutoCommitTest
[junit4] 2> Creating dataDir:
/x1/jenkins/jenkins-slave/workspace/Lucene-Solr-Tests-7.x/solr/build/solr-core/test/J2/temp/solr.update.AutoCommitTest_B678C8412043B0BF-001/init-core-data-001
[junit4] 2> 703781 WARN
(SUITE-AutoCommitTest-seed#[B678C8412043B0BF]-worker) [ ]
o.a.s.SolrTestCaseJ4 startTrackingSearchers: numOpens=1 numCloses=1
[junit4] 2> 703781 INFO
(SUITE-AutoCommitTest-seed#[B678C8412043B0BF]-worker) [ ]
o.a.s.SolrTestCaseJ4 Using PointFields (NUMERIC_POINTS_SYSPROP=true)
w/NUMERIC_DOCVALUES_SYSPROP=true
[junit4] 2> 703782 INFO
(SUITE-AutoCommitTest-seed#[B678C8412043B0BF]-worker) [ ]
o.a.s.SolrTestCaseJ4 Randomized ssl (false) and clientAuth (false) via:
@org.apache.solr.util.RandomizeSSL(reason=, ssl=NaN, value=NaN, clientAuth=NaN)
[junit4] 2> 703782 INFO
(SUITE-AutoCommitTest-seed#[B678C8412043B0BF]-worker) [ ]
o.a.s.SolrTestCaseJ4 SecureRandom sanity checks:
test.solr.allowed.securerandom=null & java.security.egd=file:/dev/./urandom
[junit4] 2> 703783 INFO
(SUITE-AutoCommitTest-seed#[B678C8412043B0BF]-worker) [ ]
o.a.s.SolrTestCaseJ4 ####initCore
[junit4] 2> 703783 INFO
(SUITE-AutoCommitTest-seed#[B678C8412043B0BF]-worker) [ ]
o.a.s.c.SolrResourceLoader [null] Added 2 libs to classloader, from paths:
[/x1/jenkins/jenkins-slave/workspace/Lucene-Solr-Tests-7.x/solr/core/src/test-files/solr/collection1/lib,

/x1/jenkins/jenkins-slave/workspace/Lucene-Solr-Tests-7.x/solr/core/src/test-files/solr/collection1/lib/classes]
[junit4] 2> 703806 INFO
(SUITE-AutoCommitTest-seed#[B678C8412043B0BF]-worker) [ ] o.a.s.c.SolrConfig
Using Lucene MatchVersion: 7.1.0
[junit4] 2> 703828 INFO
(SUITE-AutoCommitTest-seed#[B678C8412043B0BF]-worker) [ ]
o.a.s.s.IndexSchema [null] Schema name=test
[junit4] 2> 703962 INFO
(SUITE-AutoCommitTest-seed#[B678C8412043B0BF]-worker) [ ]
o.a.s.s.IndexSchema Loaded schema test/1.0 with uniqueid field id
[junit4] 2> 704001 INFO
(SUITE-AutoCommitTest-seed#[B678C8412043B0BF]-worker) [ ]
o.a.s.m.r.SolrJmxReporter JMX monitoring for 'solr.node' (registry 'solr.node')
enabled at server: com.sun.jmx.mbeanserver.JmxMBeanServer@65a82801
[junit4] 2> 704004 INFO
(SUITE-AutoCommitTest-seed#[B678C8412043B0BF]-worker) [ ]
o.a.s.m.r.SolrJmxReporter JMX monitoring for 'solr.jvm' (registry 'solr.jvm')
enabled at server: com.sun.jmx.mbeanserver.JmxMBeanServer@65a82801
[junit4] 2> 704004 INFO
(SUITE-AutoCommitTest-seed#[B678C8412043B0BF]-worker) [ ]
o.a.s.m.r.SolrJmxReporter JMX monitoring for 'solr.jetty' (registry
'solr.jetty') enabled at server: com.sun.jmx.mbeanserver.JmxMBeanServer@65a82801
[junit4] 2> 704006 INFO (coreLoadExecutor-2515-thread-1) [
x:collection1] o.a.s.c.SolrResourceLoader [null] Added 2 libs to classloader,
from paths:
[/x1/jenkins/jenkins-slave/workspace/Lucene-Solr-Tests-7.x/solr/core/src/test-files/solr/collection1/lib,

/x1/jenkins/jenkins-slave/workspace/Lucene-Solr-Tests-7.x/solr/core/src/test-files/solr/collection1/lib/classes]
[junit4] 2> 704032 INFO (coreLoadExecutor-2515-thread-1) [
x:collection1] o.a.s.c.SolrConfig Using Lucene MatchVersion: 7.1.0
[junit4] 2> 704067 INFO (coreLoadExecutor-2515-thread-1) [
x:collection1] o.a.s.s.IndexSchema [collection1] Schema name=test
[junit4] 2> 704195 INFO (coreLoadExecutor-2515-thread-1) [
x:collection1] o.a.s.s.IndexSchema Loaded schema test/1.0 with uniqueid field id
[junit4] 2> 704232 INFO (coreLoadExecutor-2515-thread-1) [
x:collection1] o.a.s.c.CoreContainer Creating SolrCore 'collection1' using
configuration from instancedir
/x1/jenkins/jenkins-slave/workspace/Lucene-Solr-Tests-7.x/solr/core/src/test-files/solr/collection1,
trusted=true
[junit4] 2> 704232 INFO (coreLoadExecutor-2515-thread-1) [
x:collection1] o.a.s.m.r.SolrJmxReporter JMX monitoring for
'solr.core.collection1' (registry 'solr.core.collection1') enabled at server:
com.sun.jmx.mbeanserver.JmxMBeanServer@65a82801
[junit4] 2> 704234 INFO (coreLoadExecutor-2515-thread-1) [
x:collection1] o.a.s.c.SolrCore solr.RecoveryStrategy.Builder
[junit4] 2> 704234 INFO (coreLoadExecutor-2515-thread-1) [
x:collection1] o.a.s.c.SolrCore [[collection1] ] Opening new SolrCore at
[/x1/jenkins/jenkins-slave/workspace/Lucene-Solr-Tests-7.x/solr/core/src/test-files/solr/collection1],

dataDir=[/x1/jenkins/jenkins-slave/workspace/Lucene-Solr-Tests-7.x/solr/build/solr-core/test/J2/temp/solr.update.AutoCommitTest_B678C8412043B0BF-001/init-core-data-001/]
[junit4] 2> 704235 INFO (coreLoadExecutor-2515-thread-1) [
x:collection1] o.a.s.u.RandomMergePolicy RandomMergePolicy wrapping class
org.apache.lucene.index.TieredMergePolicy: [TieredMergePolicy:
maxMergeAtOnce=34, maxMergeAtOnceExplicit=44, maxMergedSegmentMB=86.2431640625,
floorSegmentMB=0.5546875, forceMergeDeletesPctAllowed=17.711374737609084,
segmentsPerTier=46.0, maxCFSSegmentSizeMB=8.796093022207999E12,
noCFSRatio=0.7282147534025792
[junit4] 2> 704338 INFO (coreLoadExecutor-2515-thread-1) [
x:collection1] o.a.s.u.UpdateHandler Using UpdateLog implementation:
org.apache.solr.update.UpdateLog
[junit4] 2> 704338 INFO (coreLoadExecutor-2515-thread-1) [
x:collection1] o.a.s.u.UpdateLog Initializing UpdateLog: dataDir=
defaultSyncLevel=FLUSH numRecordsToKeep=100 maxNumLogsToKeep=10
numVersionBuckets=65536
[junit4] 2> 704339 INFO (coreLoadExecutor-2515-thread-1) [
x:collection1] o.a.s.u.CommitTracker Hard AutoCommit: disabled
[junit4] 2> 704339 INFO (coreLoadExecutor-2515-thread-1) [
x:collection1] o.a.s.u.CommitTracker Soft AutoCommit: disabled
[junit4] 2> 704341 INFO (coreLoadExecutor-2515-thread-1) [
x:collection1] o.a.s.u.RandomMergePolicy RandomMergePolicy wrapping class
org.apache.lucene.index.LogDocMergePolicy: [LogDocMergePolicy:
minMergeSize=1000, mergeFactor=14, maxMergeSize=9223372036854775807,
maxMergeSizeForForcedMerge=9223372036854775807, calibrateSizeByDeletes=true,
maxMergeDocs=2147483647, maxCFSSegmentSizeMB=8.796093022207999E12,
noCFSRatio=0.7672383413096718]
[junit4] 2> 704341 INFO (coreLoadExecutor-2515-thread-1) [
x:collection1] o.a.s.s.SolrIndexSearcher Opening
[Searcher@1dcb3755[collection1] main]
[junit4] 2> 704342 INFO (coreLoadExecutor-2515-thread-1) [
x:collection1] o.a.s.h.c.SpellCheckComponent Initializing spell checkers
[junit4] 2> 704352 INFO (coreLoadExecutor-2515-thread-1) [
x:collection1] o.a.s.s.DirectSolrSpellChecker init:
{name=direct,classname=DirectSolrSpellChecker,field=lowerfilt,minQueryLength=3}
[junit4] 2> 704380 INFO (coreLoadExecutor-2515-thread-1) [
x:collection1] o.a.s.h.ReplicationHandler Commits will be reserved for 10000
[junit4] 2> 704380 INFO
(searcherExecutor-2516-thread-1-processing-x:collection1) [ x:collection1]
o.a.s.h.c.SpellCheckComponent Loading spell index for spellchecker: default
[junit4] 2> 704381 INFO
(searcherExecutor-2516-thread-1-processing-x:collection1) [ x:collection1]
o.a.s.h.c.SpellCheckComponent Loading spell index for spellchecker: direct
[junit4] 2> 704381 INFO
(searcherExecutor-2516-thread-1-processing-x:collection1) [ x:collection1]
o.a.s.h.c.SpellCheckComponent Loading spell index for spellchecker: wordbreak
[junit4] 2> 704381 INFO
(searcherExecutor-2516-thread-1-processing-x:collection1) [ x:collection1]
o.a.s.h.c.SpellCheckComponent Loading spell index for spellchecker:
multipleFields
[junit4] 2> 704381 INFO
(searcherExecutor-2516-thread-1-processing-x:collection1) [ x:collection1]
o.a.s.h.c.SpellCheckComponent Loading spell index for spellchecker: jarowinkler
[junit4] 2> 704381 INFO
(searcherExecutor-2516-thread-1-processing-x:collection1) [ x:collection1]
o.a.s.h.c.SpellCheckComponent Loading spell index for spellchecker: external
[junit4] 2> 704381 INFO
(searcherExecutor-2516-thread-1-processing-x:collection1) [ x:collection1]
o.a.s.h.c.SpellCheckComponent Loading spell index for spellchecker: freq
[junit4] 2> 704381 INFO
(searcherExecutor-2516-thread-1-processing-x:collection1) [ x:collection1]
o.a.s.h.c.SpellCheckComponent Loading spell index for spellchecker: fqcn
[junit4] 2> 704382 INFO
(searcherExecutor-2516-thread-1-processing-x:collection1) [ x:collection1]
o.a.s.h.c.SpellCheckComponent Loading spell index for spellchecker: perDict
[junit4] 2> 704382 INFO
(searcherExecutor-2516-thread-1-processing-x:collection1) [ x:collection1]
o.a.s.c.SolrCore [collection1] Registered new searcher
Searcher@1dcb3755[collection1]
main{ExitableDirectoryReader(UninvertingDirectoryReader())}
[junit4] 2> 704383 INFO (coreLoadExecutor-2515-thread-1) [
x:collection1] o.a.s.u.UpdateLog Could not find max version in index or recent
updates, using new clock 1575605552251142144
[junit4] 2> 704386 INFO
(SUITE-AutoCommitTest-seed#[B678C8412043B0BF]-worker) [ ]
o.a.s.SolrTestCaseJ4 ####initCore end
[junit4] 2> 704387 INFO
(TEST-AutoCommitTest.testCommitWithin-seed#[B678C8412043B0BF]) [ ]
o.a.s.SolrTestCaseJ4 ###Starting testCommitWithin
[junit4] 2> 704387 INFO
(TEST-AutoCommitTest.testCommitWithin-seed#[B678C8412043B0BF]) [ ]
o.a.s.u.DirectUpdateHandler2 [collection1] REMOVING ALL DOCUMENTS FROM INDEX
[junit4] 2> 704388 INFO
(TEST-AutoCommitTest.testCommitWithin-seed#[B678C8412043B0BF]) [ ]
o.a.s.s.SolrIndexSearcher Opening [Searcher@d74388[collection1] realtime]
[junit4] 2> 704388 INFO
(TEST-AutoCommitTest.testCommitWithin-seed#[B678C8412043B0BF]) [ ]
o.a.s.u.p.LogUpdateProcessorFactory [collection1] webapp=null path=null
params={_version_=-9223372036854775807&update.distrib=FROMLEADER&versions=true&wt=json&indent=true}{deleteByQuery=*:*
(-9223372036854775807)} 0 1
[junit4] 2> 704388 ERROR
(TEST-AutoCommitTest.testCommitWithin-seed#[B678C8412043B0BF]) [ ]
o.a.s.c.CorePropertiesLocator Couldn't load core descriptor from
/x1/jenkins/jenkins-slave/workspace/Lucene-Solr-Tests-7.x/solr/core/src/test-files/solr/collection1/core.properties:java.nio.file.NoSuchFileException:

/x1/jenkins/jenkins-slave/workspace/Lucene-Solr-Tests-7.x/solr/core/src/test-files/solr/collection1/core.properties
[junit4] 2> 704389 INFO
(TEST-AutoCommitTest.testCommitWithin-seed#[B678C8412043B0BF]) [ ]
o.a.s.c.SolrResourceLoader [null] Added 2 libs to classloader, from paths:
[/x1/jenkins/jenkins-slave/workspace/Lucene-Solr-Tests-7.x/solr/core/src/test-files/solr/collection1/lib,

/x1/jenkins/jenkins-slave/workspace/Lucene-Solr-Tests-7.x/solr/core/src/test-files/solr/collection1/lib/classes]
[junit4] 2> 704420 INFO
(TEST-AutoCommitTest.testCommitWithin-seed#[B678C8412043B0BF]) [ ]
o.a.s.c.SolrConfig Using Lucene MatchVersion: 7.1.0
[junit4] 2> 704444 INFO
(TEST-AutoCommitTest.testCommitWithin-seed#[B678C8412043B0BF]) [ ]
o.a.s.s.IndexSchema [collection1] Schema name=test
[junit4] 2> 704613 INFO
(TEST-AutoCommitTest.testCommitWithin-seed#[B678C8412043B0BF]) [ ]
o.a.s.s.IndexSchema Loaded schema test/1.0 with uniqueid field id
[junit4] 2> 704622 INFO
(TEST-AutoCommitTest.testCommitWithin-seed#[B678C8412043B0BF]) [ ]
o.a.s.c.CoreContainer Reloading SolrCore 'collection1' using configuration from
instancedir
/x1/jenkins/jenkins-slave/workspace/Lucene-Solr-Tests-7.x/solr/core/src/test-files/solr/collection1
[junit4] 2> 704635 INFO
(TEST-AutoCommitTest.testCommitWithin-seed#[B678C8412043B0BF]) [
x:collection1] o.a.s.m.r.SolrJmxReporter JMX monitoring for
'solr.core.collection1' (registry 'solr.core.collection1') enabled at server:
com.sun.jmx.mbeanserver.JmxMBeanServer@65a82801
[junit4] 2> 704636 INFO
(TEST-AutoCommitTest.testCommitWithin-seed#[B678C8412043B0BF]) [
x:collection1] o.a.s.c.SolrCore [[collection1] ] Opening new SolrCore at
[/x1/jenkins/jenkins-slave/workspace/Lucene-Solr-Tests-7.x/solr/core/src/test-files/solr/collection1],

dataDir=[/x1/jenkins/jenkins-slave/workspace/Lucene-Solr-Tests-7.x/solr/build/solr-core/test/J2/temp/solr.update.AutoCommitTest_B678C8412043B0BF-001/init-core-data-001/]
[junit4] 2> 704697 INFO
(TEST-AutoCommitTest.testCommitWithin-seed#[B678C8412043B0BF]) [
x:collection1] o.a.s.u.CommitTracker Hard AutoCommit: disabled
[junit4] 2> 704697 INFO
(TEST-AutoCommitTest.testCommitWithin-seed#[B678C8412043B0BF]) [
x:collection1] o.a.s.u.CommitTracker Soft AutoCommit: disabled
[junit4] 2> 704698 INFO
(TEST-AutoCommitTest.testCommitWithin-seed#[B678C8412043B0BF]) [
x:collection1] o.a.s.s.SolrIndexSearcher Opening
[Searcher@6d6a2fae[collection1] main]
[junit4] 2> 704699 INFO
(TEST-AutoCommitTest.testCommitWithin-seed#[B678C8412043B0BF]) [
x:collection1] o.a.s.h.c.SpellCheckComponent Initializing spell checkers
[junit4] 2> 704699 INFO
(TEST-AutoCommitTest.testCommitWithin-seed#[B678C8412043B0BF]) [
x:collection1] o.a.s.s.DirectSolrSpellChecker init:
{name=direct,classname=DirectSolrSpellChecker,field=lowerfilt,minQueryLength=3}
[junit4] 2> 704702 INFO
(TEST-AutoCommitTest.testCommitWithin-seed#[B678C8412043B0BF]) [
x:collection1] o.a.s.h.ReplicationHandler Commits will be reserved for 10000
[junit4] 2> 704702 INFO
(TEST-AutoCommitTest.testCommitWithin-seed#[B678C8412043B0BF]) [
x:collection1] o.a.s.u.UpdateLog Could not find max version in index or recent
updates, using new clock 1575605552585637888
[junit4] 2> 704704 INFO
(searcherExecutor-2521-thread-1-processing-x:collection1) [ x:collection1]
o.a.s.h.c.SpellCheckComponent Loading spell index for spellchecker: default
[junit4] 2> 704704 INFO
(searcherExecutor-2521-thread-1-processing-x:collection1) [ x:collection1]
o.a.s.h.c.SpellCheckComponent Loading spell index for spellchecker: direct
[junit4] 2> 704704 INFO
(searcherExecutor-2521-thread-1-processing-x:collection1) [ x:collection1]
o.a.s.h.c.SpellCheckComponent Loading spell index for spellchecker: wordbreak
[junit4] 2> 704704 INFO
(searcherExecutor-2521-thread-1-processing-x:collection1) [ x:collection1]
o.a.s.h.c.SpellCheckComponent Loading spell index for spellchecker:
multipleFields
[junit4] 2> 704704 INFO
(searcherExecutor-2521-thread-1-processing-x:collection1) [ x:collection1]
o.a.s.h.c.SpellCheckComponent Loading spell index for spellchecker: jarowinkler
[junit4] 2> 704705 INFO
(searcherExecutor-2521-thread-1-processing-x:collection1) [ x:collection1]
o.a.s.h.c.SpellCheckComponent Loading spell index for spellchecker: external
[junit4] 2> 704705 INFO
(searcherExecutor-2521-thread-1-processing-x:collection1) [ x:collection1]
o.a.s.h.c.SpellCheckComponent Loading spell index for spellchecker: freq
[junit4] 2> 704705 INFO
(searcherExecutor-2521-thread-1-processing-x:collection1) [ x:collection1]
o.a.s.h.c.SpellCheckComponent Loading spell index for spellchecker: fqcn
[junit4] 2> 704705 INFO
(searcherExecutor-2521-thread-1-processing-x:collection1) [ x:collection1]
o.a.s.h.c.SpellCheckComponent Loading spell index for spellchecker: perDict
[junit4] 2> 704707 INFO
(searcherExecutor-2521-thread-1-processing-x:collection1) [ x:collection1]
o.a.s.c.SolrCore [collection1] Registered new searcher
Searcher@6d6a2fae[collection1]
main{ExitableDirectoryReader(UninvertingDirectoryReader())}
[junit4] 2> 704707 INFO
(TEST-AutoCommitTest.testCommitWithin-seed#[B678C8412043B0BF]) [
x:collection1] o.a.s.u.RandomMergePolicy RandomMergePolicy wrapping class
org.apache.lucene.index.MockRandomMergePolicy:
org.apache.lucene.index.MockRandomMergePolicy@156e061c
[junit4] 2> 704707 INFO
(TEST-AutoCommitTest.testCommitWithin-seed#[B678C8412043B0BF]) [
x:collection1] o.a.s.u.DefaultSolrCoreState New IndexWriter is ready to be used.
[junit4] 2> 704708 INFO
(TEST-AutoCommitTest.testCommitWithin-seed#[B678C8412043B0BF]) [
x:collection1] o.a.s.s.SolrIndexSearcher Opening [Searcher@9543798[collection1]
main]
[junit4] 2> 704708 INFO
(TEST-AutoCommitTest.testCommitWithin-seed#[B678C8412043B0BF]) [
x:collection1] o.a.s.c.SolrCore [collection1] CLOSING SolrCore
org.apache.solr.core.SolrCore@2f9c91db
[junit4] 2> 704708 INFO
(TEST-AutoCommitTest.testCommitWithin-seed#[B678C8412043B0BF]) [
x:collection1] o.a.s.m.SolrMetricManager Closing metric reporters for
registry=solr.core.collection1, tag=798790107
[junit4] 2> 704711 INFO
(searcherExecutor-2521-thread-1-processing-x:collection1) [ x:collection1]
o.a.s.c.SolrCore [collection1] Registered new searcher
Searcher@9543798[collection1]
main{ExitableDirectoryReader(UninvertingDirectoryReader())}
[junit4] 2> 704729 INFO
(TEST-AutoCommitTest.testCommitWithin-seed#[B678C8412043B0BF]) [
x:collection1] o.a.s.u.p.LogUpdateProcessorFactory [collection1] {add=[529
(1575605552600317952)]} 0 13
[junit4] 2> 704729 INFO
(TEST-AutoCommitTest.testCommitWithin-seed#[B678C8412043B0BF]) [
x:collection1] o.a.s.c.S.Request [collection1] webapp=null path=null
params={q=id:529&qt=&start=0&rows=20&version=2.2} hits=0 status=0 QTime=0
[junit4] 2> 708721 INFO (commitScheduler-2524-thread-1) [
x:collection1] o.a.s.u.DirectUpdateHandler2 start
commit{,optimize=false,openSearcher=true,waitSearcher=true,expungeDeletes=false,softCommit=true,prepareCommit=false}
[junit4] 2> 708739 INFO (commitScheduler-2524-thread-1) [
x:collection1] o.a.s.s.SolrIndexSearcher Opening [Searcher@1a4ec38[collection1]
main]
[junit4] 2> 708741 INFO (commitScheduler-2524-thread-1) [
x:collection1] o.a.s.u.DirectUpdateHandler2 end_commit_flush
[junit4] 2> 708741 INFO
(searcherExecutor-2521-thread-1-processing-x:collection1) [ x:collection1]
o.a.s.c.SolrCore [collection1] Registered new searcher
Searcher@1a4ec38[collection1]
main{ExitableDirectoryReader(UninvertingDirectoryReader(Uninverting(_0(7.1.0):c1)))}
[junit4] 2> 708742 INFO
(TEST-AutoCommitTest.testCommitWithin-seed#[B678C8412043B0BF]) [
x:collection1] o.a.s.u.p.LogUpdateProcessorFactory [collection1] {add=[530
(1575605556821884928)]} 0 4027
[junit4] 2> 708743 INFO
(TEST-AutoCommitTest.testCommitWithin-seed#[B678C8412043B0BF]) [
x:collection1] o.a.s.c.S.Request [collection1] webapp=null path=null
params={q=id:530&qt=&start=0&rows=20&version=2.2} hits=0 status=0 QTime=0
[junit4] 2> 708743 INFO
(TEST-AutoCommitTest.testCommitWithin-seed#[B678C8412043B0BF]) [
x:collection1] o.a.s.u.p.LogUpdateProcessorFactory [collection1] {delete=[529
(-1575605556822933504)]} 0 4028
[junit4] 2> 708743 INFO
(TEST-AutoCommitTest.testCommitWithin-seed#[B678C8412043B0BF]) [
x:collection1] o.a.s.c.S.Request [collection1] webapp=null path=null
params={q=id:529&qt=&start=0&rows=20&version=2.2} hits=1 status=0 QTime=0
[junit4] 2> 710743 INFO (commitScheduler-2524-thread-1) [
x:collection1] o.a.s.u.DirectUpdateHandler2 start
commit{,optimize=false,openSearcher=true,waitSearcher=true,expungeDeletes=false,softCommit=true,prepareCommit=false}
[junit4] 2> 710746 INFO (commitScheduler-2524-thread-1) [
x:collection1] o.a.s.s.SolrIndexSearcher Opening
[Searcher@765c2852[collection1] main]
[junit4] 2> 710746 INFO (commitScheduler-2524-thread-1) [
x:collection1] o.a.s.u.DirectUpdateHandler2 end_commit_flush
[junit4] 2> 710747 INFO
(searcherExecutor-2521-thread-1-processing-x:collection1) [ x:collection1]
o.a.s.c.SolrCore [collection1] Registered new searcher
Searcher@765c2852[collection1]
main{ExitableDirectoryReader(UninvertingDirectoryReader(Uninverting(_1(7.1.0):c1)))}
[junit4] 2> 710995 INFO
(TEST-AutoCommitTest.testCommitWithin-seed#[B678C8412043B0BF]) [
x:collection1] o.a.s.c.S.Request [collection1] webapp=null path=null
params={q=id:529&qt=&start=0&rows=20&version=2.2} hits=0 status=0 QTime=0
[junit4] 2> 710996 INFO
(TEST-AutoCommitTest.testCommitWithin-seed#[B678C8412043B0BF]) [
x:collection1] o.a.s.c.S.Request [collection1] webapp=null path=null
params={q=id:530&qt=&start=0&rows=20&version=2.2} hits=1 status=0 QTime=0
[junit4] 2> 710997 INFO
(TEST-AutoCommitTest.testCommitWithin-seed#[B678C8412043B0BF]) [
x:collection1] o.a.s.u.p.LogUpdateProcessorFactory [collection1] {add=[500
(1575605559186423808)]} 0 6281
[junit4] 2> 710997 INFO
(TEST-AutoCommitTest.testCommitWithin-seed#[B678C8412043B0BF]) [
x:collection1] o.a.s.u.p.LogUpdateProcessorFactory [collection1] {add=[500
(1575605559186423809)]} 0 6282
[junit4] 2> 710997 INFO
(TEST-AutoCommitTest.testCommitWithin-seed#[B678C8412043B0BF]) [
x:collection1] o.a.s.u.p.LogUpdateProcessorFactory [collection1] {add=[500
(1575605559186423810)]} 0 6282
[junit4] 2> 710998 INFO
(TEST-AutoCommitTest.testCommitWithin-seed#[B678C8412043B0BF]) [
x:collection1] o.a.s.u.p.LogUpdateProcessorFactory [collection1] {add=[500
(1575605559187472384)]} 0 6282
[junit4] 2> 710998 INFO
(TEST-AutoCommitTest.testCommitWithin-seed#[B678C8412043B0BF]) [
x:collection1] o.a.s.u.p.LogUpdateProcessorFactory [collection1] {add=[500
(1575605559187472385)]} 0 6282
[junit4] 2> 710998 INFO
(TEST-AutoCommitTest.testCommitWithin-seed#[B678C8412043B0BF]) [
x:collection1] o.a.s.u.p.LogUpdateProcessorFactory [collection1] {add=[500
(1575605559187472386)]} 0 6282
[junit4] 2> 710998 INFO
(TEST-AutoCommitTest.testCommitWithin-seed#[B678C8412043B0BF]) [
x:collection1] o.a.s.u.p.LogUpdateProcessorFactory [collection1] {add=[500
(1575605559187472387)]} 0 6282
[junit4] 2> 710998 INFO
(TEST-AutoCommitTest.testCommitWithin-seed#[B678C8412043B0BF]) [
x:collection1] o.a.s.u.p.LogUpdateProcessorFactory [collection1] {add=[500
(1575605559187472388)]} 0 6282
[junit4] 2> 710998 INFO
(TEST-AutoCommitTest.testCommitWithin-seed#[B678C8412043B0BF]) [
x:collection1] o.a.s.u.p.LogUpdateProcessorFactory [collection1] {add=[500
(1575605559187472389)]} 0 6283
[junit4] 2> 710998 INFO
(TEST-AutoCommitTest.testCommitWithin-seed#[B678C8412043B0BF]) [
x:collection1] o.a.s.u.p.LogUpdateProcessorFactory [collection1] {add=[500
(1575605559187472390)]} 0 6283
[junit4] 2> 710999 INFO
(TEST-AutoCommitTest.testCommitWithin-seed#[B678C8412043B0BF]) [
x:collection1] o.a.s.c.S.Request [collection1] webapp=null path=null
params={q=id:500&qt=&start=0&rows=20&version=2.2} hits=0 status=0 QTime=0
[junit4] 2> 710999 INFO
(TEST-AutoCommitTest.testCommitWithin-seed#[B678C8412043B0BF]) [
x:collection1] o.a.s.u.p.LogUpdateProcessorFactory [collection1] {delete=[530
(-1575605559188520960)]} 0 6283
[junit4] 2> 710999 INFO
(TEST-AutoCommitTest.testCommitWithin-seed#[B678C8412043B0BF]) [
x:collection1] o.a.s.u.p.LogUpdateProcessorFactory [collection1] {delete=[530
(-1575605559188520961)]} 0 6283
[junit4] 2> 710999 INFO
(TEST-AutoCommitTest.testCommitWithin-seed#[B678C8412043B0BF]) [
x:collection1] o.a.s.u.p.LogUpdateProcessorFactory [collection1] {delete=[530
(-1575605559188520962)]} 0 6283
[junit4] 2> 710999 INFO
(TEST-AutoCommitTest.testCommitWithin-seed#[B678C8412043B0BF]) [
x:collection1] o.a.s.u.p.LogUpdateProcessorFactory [collection1] {delete=[530
(-1575605559188520963)]} 0 6284
[junit4] 2> 710999 INFO
(TEST-AutoCommitTest.testCommitWithin-seed#[B678C8412043B0BF]) [
x:collection1] o.a.s.u.p.LogUpdateProcessorFactory [collection1] {delete=[530
(-1575605559188520964)]} 0 6284
[junit4] 2> 710999 INFO
(TEST-AutoCommitTest.testCommitWithin-seed#[B678C8412043B0BF]) [
x:collection1] o.a.s.u.p.LogUpdateProcessorFactory [collection1] {delete=[530
(-1575605559188520965)]} 0 6284
[junit4] 2> 711000 INFO
(TEST-AutoCommitTest.testCommitWithin-seed#[B678C8412043B0BF]) [
x:collection1] o.a.s.u.p.LogUpdateProcessorFactory [collection1] {delete=[530
(-1575605559189569536)]} 0 6284
[junit4] 2> 711000 INFO
(TEST-AutoCommitTest.testCommitWithin-seed#[B678C8412043B0BF]) [
x:collection1] o.a.s.u.p.LogUpdateProcessorFactory [collection1] {delete=[530
(-1575605559189569537)]} 0 6284
[junit4] 2> 711000 INFO
(TEST-AutoCommitTest.testCommitWithin-seed#[B678C8412043B0BF]) [
x:collection1] o.a.s.u.p.LogUpdateProcessorFactory [collection1] {delete=[530
(-1575605559189569538)]} 0 6284
[junit4] 2> 711000 INFO
(TEST-AutoCommitTest.testCommitWithin-seed#[B678C8412043B0BF]) [
x:collection1] o.a.s.u.p.LogUpdateProcessorFactory [collection1] {delete=[530
(-1575605559189569539)]} 0 6284
[junit4] 2> 711000 INFO
(TEST-AutoCommitTest.testCommitWithin-seed#[B678C8412043B0BF]) [
x:collection1] o.a.s.c.S.Request [collection1] webapp=null path=null
params={q=id:530&qt=&start=0&rows=20&version=2.2} hits=1 status=0 QTime=0
[junit4] 2> 711999 INFO (commitScheduler-2524-thread-1) [
x:collection1] o.a.s.u.DirectUpdateHandler2 start
commit{,optimize=false,openSearcher=true,waitSearcher=true,expungeDeletes=false,softCommit=true,prepareCommit=false}
[junit4] 2> 712005 INFO (commitScheduler-2524-thread-1) [
x:collection1] o.a.s.s.SolrIndexSearcher Opening
[Searcher@5c465414[collection1] main]
[junit4] 2> 712005 INFO (commitScheduler-2524-thread-1) [
x:collection1] o.a.s.u.DirectUpdateHandler2 end_commit_flush
[junit4] 2> 712006 INFO
(searcherExecutor-2521-thread-1-processing-x:collection1) [ x:collection1]
o.a.s.c.SolrCore [collection1] Registered new searcher
Searcher@5c465414[collection1]
main{ExitableDirectoryReader(UninvertingDirectoryReader(Uninverting(_2(7.1.0):c10/9:delGen=1)))}
[junit4] 2> 712251 INFO
(TEST-AutoCommitTest.testCommitWithin-seed#[B678C8412043B0BF]) [
x:collection1] o.a.s.c.S.Request [collection1] webapp=null path=null
params={q=id:500&qt=&start=0&rows=20&version=2.2} hits=1 status=0 QTime=0
[junit4] 2> 712252 INFO
(TEST-AutoCommitTest.testCommitWithin-seed#[B678C8412043B0BF]) [
x:collection1] o.a.s.c.S.Request [collection1] webapp=null path=null
params={q=id:530&qt=&start=0&rows=20&version=2.2} hits=0 status=0 QTime=0
[junit4] 2> 712252 INFO
(TEST-AutoCommitTest.testCommitWithin-seed#[B678C8412043B0BF]) [
x:collection1] o.a.s.SolrTestCaseJ4 ###Ending testCommitWithin
[junit4] 2> 712254 INFO
(TEST-AutoCommitTest.testMaxDocs-seed#[B678C8412043B0BF]) [ x:collection1]
o.a.s.SolrTestCaseJ4 ###Starting testMaxDocs
[junit4] 2> 712255 INFO
(TEST-AutoCommitTest.testMaxDocs-seed#[B678C8412043B0BF]) [ x:collection1]
o.a.s.u.DirectUpdateHandler2 [collection1] REMOVING ALL DOCUMENTS FROM INDEX
[junit4] 2> 712255 INFO
(TEST-AutoCommitTest.testMaxDocs-seed#[B678C8412043B0BF]) [ x:collection1]
o.a.s.s.SolrIndexSearcher Opening [Searcher@240dbf84[collection1] realtime]
[junit4] 2> 712255 INFO
(TEST-AutoCommitTest.testMaxDocs-seed#[B678C8412043B0BF]) [ x:collection1]
o.a.s.u.p.LogUpdateProcessorFactory [collection1] webapp=null path=null
params={_version_=-9223372036854775807&update.distrib=FROMLEADER&versions=true&wt=json&indent=true}{deleteByQuery=*:*
(-9223372036854775807)} 0 0
[junit4] 2> 712255 ERROR
(TEST-AutoCommitTest.testMaxDocs-seed#[B678C8412043B0BF]) [ x:collection1]
o.a.s.c.CorePropertiesLocator Couldn't load core descriptor from
/x1/jenkins/jenkins-slave/workspace/Lucene-Solr-Tests-7.x/solr/core/src/test-files/solr/collection1/core.properties:java.nio.file.NoSuchFileException:

/x1/jenkins/jenkins-slave/workspace/Lucene-Solr-Tests-7.x/solr/core/src/test-files/solr/collection1/core.properties
[junit4] 2> 712256 INFO
(TEST-AutoCommitTest.testMaxDocs-seed#[B678C8412043B0BF]) [ x:collection1]
o.a.s.c.SolrResourceLoader [null] Added 2 libs to classloader, from paths:
[/x1/jenkins/jenkins-slave/workspace/Lucene-Solr-Tests-7.x/solr/core/src/test-files/solr/collection1/lib,

/x1/jenkins/jenkins-slave/workspace/Lucene-Solr-Tests-7.x/solr/core/src/test-files/solr/collection1/lib/classes]
[junit4] 2> 712295 INFO
(TEST-AutoCommitTest.testMaxDocs-seed#[B678C8412043B0BF]) [ x:collection1]
o.a.s.c.SolrConfig Using Lucene MatchVersion: 7.1.0
[junit4] 2> 712319 INFO
(TEST-AutoCommitTest.testMaxDocs-seed#[B678C8412043B0BF]) [ x:collection1]
o.a.s.s.IndexSchema [collection1] Schema name=test
[junit4] 2> 712513 INFO
(TEST-AutoCommitTest.testMaxDocs-seed#[B678C8412043B0BF]) [ x:collection1]
o.a.s.s.IndexSchema Loaded schema test/1.0 with uniqueid field id
[junit4] 2> 712529 INFO
(TEST-AutoCommitTest.testMaxDocs-seed#[B678C8412043B0BF]) [ x:collection1]
o.a.s.c.CoreContainer Reloading SolrCore 'collection1' using configuration from
instancedir
/x1/jenkins/jenkins-slave/workspace/Lucene-Solr-Tests-7.x/solr/core/src/test-files/solr/collection1
[junit4] 2> 712539 INFO
(TEST-AutoCommitTest.testMaxDocs-seed#[B678C8412043B0BF]) [ x:collection1]
o.a.s.m.r.SolrJmxReporter JMX monitoring for 'solr.core.collection1' (registry
'solr.core.collection1') enabled at server:
com.sun.jmx.mbeanserver.JmxMBeanServer@65a82801
[junit4] 2> 712539 INFO
(TEST-AutoCommitTest.testMaxDocs-seed#[B678C8412043B0BF]) [ x:collection1]
o.a.s.c.SolrCore [[collection1] ] Opening new SolrCore at
[/x1/jenkins/jenkins-slave/workspace/Lucene-Solr-Tests-7.x/solr/core/src/test-files/solr/collection1],

dataDir=[/x1/jenkins/jenkins-slave/workspace/Lucene-Solr-Tests-7.x/solr/build/solr-core/test/J2/temp/solr.update.AutoCommitTest_B678C8412043B0BF-001/init-core-data-001/]
[junit4] 2> 712578 INFO
(TEST-AutoCommitTest.testMaxDocs-seed#[B678C8412043B0BF]) [ x:collection1]
o.a.s.u.CommitTracker Hard AutoCommit: disabled
[junit4] 2> 712578 INFO
(TEST-AutoCommitTest.testMaxDocs-seed#[B678C8412043B0BF]) [ x:collection1]
o.a.s.u.CommitTracker Soft AutoCommit: disabled
[junit4] 2> 712579 INFO
(TEST-AutoCommitTest.testMaxDocs-seed#[B678C8412043B0BF]) [ x:collection1]
o.a.s.s.SolrIndexSearcher Opening [Searcher@6ba169db[collection1] main]
[junit4] 2> 712580 INFO
(TEST-AutoCommitTest.testMaxDocs-seed#[B678C8412043B0BF]) [ x:collection1]
o.a.s.h.c.SpellCheckComponent Initializing spell checkers
[junit4] 2> 712581 INFO
(TEST-AutoCommitTest.testMaxDocs-seed#[B678C8412043B0BF]) [ x:collection1]
o.a.s.s.DirectSolrSpellChecker init:
{name=direct,classname=DirectSolrSpellChecker,field=lowerfilt,minQueryLength=3}
[junit4] 2> 712583 INFO
(TEST-AutoCommitTest.testMaxDocs-seed#[B678C8412043B0BF]) [ x:collection1]
o.a.s.h.ReplicationHandler Commits will be reserved for 10000
[junit4] 2> 712585 INFO
(searcherExecutor-2525-thread-1-processing-x:collection1) [ x:collection1]
o.a.s.h.c.SpellCheckComponent Loading spell index for spellchecker: default
[junit4] 2> 712586 INFO
(searcherExecutor-2525-thread-1-processing-x:collection1) [ x:collection1]
o.a.s.h.c.SpellCheckComponent Loading spell index for spellchecker: direct
[junit4] 2> 712586 INFO
(searcherExecutor-2525-thread-1-processing-x:collection1) [ x:collection1]
o.a.s.h.c.SpellCheckComponent Loading spell index for spellchecker: wordbreak
[junit4] 2> 712586 INFO
(searcherExecutor-2525-thread-1-processing-x:collection1) [ x:collection1]
o.a.s.h.c.SpellCheckComponent Loading spell index for spellchecker:
multipleFields
[junit4] 2> 712586 INFO
(searcherExecutor-2525-thread-1-processing-x:collection1) [ x:collection1]
o.a.s.h.c.SpellCheckComponent Loading spell index for spellchecker: jarowinkler
[junit4] 2> 712586 INFO
(searcherExecutor-2525-thread-1-processing-x:collection1) [ x:collection1]
o.a.s.h.c.SpellCheckComponent Loading spell index for spellchecker: external
[junit4] 2> 712586 INFO
(TEST-AutoCommitTest.testMaxDocs-seed#[B678C8412043B0BF]) [ x:collection1]
o.a.s.u.RandomMergePolicy RandomMergePolicy wrapping class
org.apache.lucene.index.TieredMergePolicy: [TieredMergePolicy:
maxMergeAtOnce=14, maxMergeAtOnceExplicit=47, maxMergedSegmentMB=37.716796875,
floorSegmentMB=2.1875, forceMergeDeletesPctAllowed=17.0160699084753,
segmentsPerTier=17.0, maxCFSSegmentSizeMB=8.796093022207999E12,
noCFSRatio=0.14275291327439243
[junit4] 2> 712586 INFO
(searcherExecutor-2525-thread-1-processing-x:collection1) [ x:collection1]
o.a.s.h.c.SpellCheckComponent Loading spell index for spellchecker: freq
[junit4] 2> 712586 INFO
(searcherExecutor-2525-thread-1-processing-x:collection1) [ x:collection1]
o.a.s.h.c.SpellCheckComponent Loading spell index for spellchecker: fqcn
[junit4] 2> 712587 INFO
(searcherExecutor-2525-thread-1-processing-x:collection1) [ x:collection1]
o.a.s.h.c.SpellCheckComponent Loading spell index for spellchecker: perDict
[junit4] 2> 712589 INFO
(searcherExecutor-2525-thread-1-processing-x:collection1) [ x:collection1]
o.a.s.c.SolrCore [collection1] Registered new searcher
Searcher@6ba169db[collection1]
main{ExitableDirectoryReader(UninvertingDirectoryReader())}
[junit4] 2> 712589 INFO
(TEST-AutoCommitTest.testMaxDocs-seed#[B678C8412043B0BF]) [ x:collection1]
o.a.s.u.DefaultSolrCoreState New IndexWriter is ready to be used.
[junit4] 2> 712589 INFO
(TEST-AutoCommitTest.testMaxDocs-seed#[B678C8412043B0BF]) [ x:collection1]
o.a.s.s.SolrIndexSearcher Opening [Searcher@680f16ae[collection1] main]
[junit4] 2> 712589 INFO
(TEST-AutoCommitTest.testMaxDocs-seed#[B678C8412043B0BF]) [ x:collection1]
o.a.s.c.SolrCore [collection1] CLOSING SolrCore
org.apache.solr.core.SolrCore@6e96ea21
[junit4] 2> 712590 INFO
(TEST-AutoCommitTest.testMaxDocs-seed#[B678C8412043B0BF]) [ x:collection1]
o.a.s.m.SolrMetricManager Closing metric reporters for
registry=solr.core.collection1, tag=1855384097
[junit4] 2> 712600 INFO
(searcherExecutor-2525-thread-1-processing-x:collection1) [ x:collection1]
o.a.s.c.SolrCore [collection1] Registered new searcher
Searcher@680f16ae[collection1]
main{ExitableDirectoryReader(UninvertingDirectoryReader())}
[junit4] 2> 712601 INFO
(TEST-AutoCommitTest.testMaxDocs-seed#[B678C8412043B0BF]) [ x:collection1]
o.a.s.u.p.LogUpdateProcessorFactory [collection1] {add=[0
(1575605560858902528)]} 0 9
[junit4] 2> 712601 INFO
(TEST-AutoCommitTest.testMaxDocs-seed#[B678C8412043B0BF]) [ x:collection1]
o.a.s.u.p.LogUpdateProcessorFactory [collection1] {add=[1
(1575605560868339712)]} 0 9
[junit4] 2> 712601 INFO
(TEST-AutoCommitTest.testMaxDocs-seed#[B678C8412043B0BF]) [ x:collection1]
o.a.s.u.p.LogUpdateProcessorFactory [collection1] {add=[2
(1575605560868339713)]} 0 9
[junit4] 2> 712601 INFO
(TEST-AutoCommitTest.testMaxDocs-seed#[B678C8412043B0BF]) [ x:collection1]
o.a.s.u.p.LogUpdateProcessorFactory [collection1] {add=[3
(1575605560868339714)]} 0 9
[junit4] 2> 712601 INFO
(TEST-AutoCommitTest.testMaxDocs-seed#[B678C8412043B0BF]) [ x:collection1]
o.a.s.u.p.LogUpdateProcessorFactory [collection1] {add=[4
(1575605560868339715)]} 0 10
[junit4] 2> 712602 INFO
(TEST-AutoCommitTest.testMaxDocs-seed#[B678C8412043B0BF]) [ x:collection1]
o.a.s.u.p.LogUpdateProcessorFactory [collection1] {add=[5
(1575605560869388288)]} 0 10
[junit4] 2> 712604 INFO
(TEST-AutoCommitTest.testMaxDocs-seed#[B678C8412043B0BF]) [ x:collection1]
o.a.s.u.p.LogUpdateProcessorFactory [collection1] {add=[6
(1575605560869388289)]} 0 12
[junit4] 2> 712604 INFO
(TEST-AutoCommitTest.testMaxDocs-seed#[B678C8412043B0BF]) [ x:collection1]
o.a.s.u.p.LogUpdateProcessorFactory [collection1] {add=[7
(1575605560871485440)]} 0 12
[junit4] 2> 712604 INFO
(TEST-AutoCommitTest.testMaxDocs-seed#[B678C8412043B0BF]) [ x:collection1]
o.a.s.u.p.LogUpdateProcessorFactory [collection1] {add=[8
(1575605560871485441)]} 0 12
[junit4] 2> 712605 INFO
(TEST-AutoCommitTest.testMaxDocs-seed#[B678C8412043B0BF]) [ x:collection1]
o.a.s.u.p.LogUpdateProcessorFactory [collection1] {add=[9
(1575605560871485442)]} 0 13
[junit4] 2> 712605 INFO
(TEST-AutoCommitTest.testMaxDocs-seed#[B678C8412043B0BF]) [ x:collection1]
o.a.s.u.p.LogUpdateProcessorFactory [collection1] {add=[10
(1575605560872534016)]} 0 13
[junit4] 2> 712618 INFO
(TEST-AutoCommitTest.testMaxDocs-seed#[B678C8412043B0BF]) [ x:collection1]
o.a.s.u.p.LogUpdateProcessorFactory [collection1] {add=[11
(1575605560872534017)]} 0 26
[junit4] 2> 712624 INFO
(TEST-AutoCommitTest.testMaxDocs-seed#[B678C8412043B0BF]) [ x:collection1]
o.a.s.u.p.LogUpdateProcessorFactory [collection1] {add=[12
(1575605560886165504)]} 0 32
[junit4] 2> 712625 INFO
(TEST-AutoCommitTest.testMaxDocs-seed#[B678C8412043B0BF]) [ x:collection1]
o.a.s.u.p.LogUpdateProcessorFactory [collection1] {add=[13
(1575605560893505536)]} 0 33
[junit4] 2> 712625 INFO
(TEST-AutoCommitTest.testMaxDocs-seed#[B678C8412043B0BF]) [ x:collection1]
o.a.s.c.S.Request [collection1] webapp=null path=null
params={q=id:1&qt=&start=0&rows=20&version=2.2} hits=0 status=0 QTime=0
[junit4] 2> 712639 INFO
(TEST-AutoCommitTest.testMaxDocs-seed#[B678C8412043B0BF]) [ x:collection1]
o.a.s.u.p.LogUpdateProcessorFactory [collection1] {add=[14
(1575605560894554112)]} 0 47
[junit4] 2> 712640 INFO
(TEST-AutoCommitTest.testMaxDocs-seed#[B678C8412043B0BF]) [ x:collection1]
o.a.s.u.p.LogUpdateProcessorFactory [collection1] {add=[15
(1575605560909234176)]} 0 48
[junit4] 2> 712640 INFO
(TEST-AutoCommitTest.testMaxDocs-seed#[B678C8412043B0BF]) [ x:collection1]
o.a.s.c.S.Request [collection1] webapp=null path=null
params={q=id:14&qt=&start=0&rows=20&version=2.2} hits=0 status=0 QTime=0
[junit4] 2> 712641 ERROR
(TEST-AutoCommitTest.testMaxDocs-seed#[B678C8412043B0BF]) [ x:collection1]
o.a.s.SolrTestCaseJ4 REQUEST FAILED: xpath=//result[@numFound=1]
[junit4] 2> xml response was: <?xml version="1.0" encoding="UTF-8"?>
[junit4] 2> <response>
[junit4] 2> <lst name="responseHeader"><int name="status">0</int><int
name="QTime">0</int></lst><result name="response" numFound="0"
start="0"></result>
[junit4] 2> </response>
[junit4] 2>
[junit4] 2> request was:q=id:14&qt=&start=0&rows=20&version=2.2
[junit4] 2> 712641 ERROR
(TEST-AutoCommitTest.testMaxDocs-seed#[B678C8412043B0BF]) [ x:collection1]
o.a.s.SolrTestCaseJ4 REQUEST FAILED:
q=id:14&qt=&start=0&rows=20&version=2.2:java.lang.RuntimeException: REQUEST
FAILED: xpath=//result[@numFound=1]
[junit4] 2> xml response was: <?xml version="1.0" encoding="UTF-8"?>
[junit4] 2> <response>
[junit4] 2> <lst name="responseHeader"><int name="status">0</int><int
name="QTime">0</int></lst><result name="response" numFound="0"
start="0"></result>
[junit4] 2> </response>
[junit4] 2>
[junit4] 2> request was:q=id:14&qt=&start=0&rows=20&version=2.2
[junit4] 2> at
org.apache.solr.SolrTestCaseJ4.assertQ(SolrTestCaseJ4.java:879)
[junit4] 2> at
org.apache.solr.update.AutoCommitTest.testMaxDocs(AutoCommitTest.java:225)
[junit4] 2> at sun.reflect.NativeMethodAccessorImpl.invoke0(Native
Method)
[junit4] 2> at
sun.reflect.NativeMethodAccessorImpl.invoke(NativeMethodAccessorImpl.java:62)
[junit4] 2> at
sun.reflect.DelegatingMethodAccessorImpl.invoke(DelegatingMethodAccessorImpl.java:43)
[junit4] 2> at java.lang.reflect.Method.invoke(Method.java:498)
[junit4] 2> at
com.carrotsearch.randomizedtesting.RandomizedRunner.invoke(RandomizedRunner.java:1713)
[junit4] 2> at
com.carrotsearch.randomizedtesting.RandomizedRunner$8.evaluate(RandomizedRunner.java:907)
[junit4] 2> at
com.carrotsearch.randomizedtesting.RandomizedRunner$9.evaluate(RandomizedRunner.java:943)
[junit4] 2> at
com.carrotsearch.randomizedtesting.RandomizedRunner$10.evaluate(RandomizedRunner.java:957)
[junit4] 2> at
com.carrotsearch.randomizedtesting.rules.SystemPropertiesRestoreRule$1.evaluate(SystemPropertiesRestoreRule.java:57)
[junit4] 2> at
org.apache.lucene.util.TestRuleSetupTeardownChained$1.evaluate(TestRuleSetupTeardownChained.java:49)
[junit4] 2> at
org.apache.lucene.util.AbstractBeforeAfterRule$1.evaluate(AbstractBeforeAfterRule.java:45)
[junit4] 2> at
org.apache.lucene.util.TestRuleThreadAndTestName$1.evaluate(TestRuleThreadAndTestName.java:48)
[junit4] 2> at
org.apache.lucene.util.TestRuleIgnoreAfterMaxFailures$1.evaluate(TestRuleIgnoreAfterMaxFailures.java:64)
[junit4] 2> at
org.apache.lucene.util.TestRuleMarkFailure$1.evaluate(TestRuleMarkFailure.java:47)
[junit4] 2> at
com.carrotsearch.randomizedtesting.rules.StatementAdapter.evaluate(StatementAdapter.java:36)
[junit4] 2> at
com.carrotsearch.randomizedtesting.ThreadLeakControl$StatementRunner.run(ThreadLeakControl.java:368)
[junit4] 2> at
com.carrotsearch.randomizedtesting.ThreadLeakControl.forkTimeoutingTask(ThreadLeakControl.java:817)
[junit4] 2> at
com.carrotsearch.randomizedtesting.ThreadLeakControl$3.evaluate(ThreadLeakControl.java:468)
[junit4] 2> at
com.carrotsearch.randomizedtesting.RandomizedRunner.runSingleTest(RandomizedRunner.java:916)
[junit4] 2> at
com.carrotsearch.randomizedtesting.RandomizedRunner$5.evaluate(RandomizedRunner.java:802)
[junit4] 2> at
com.carrotsearch.randomizedtesting.RandomizedRunner$6.evaluate(RandomizedRunner.java:852)
[junit4] 2> at
com.carrotsearch.randomizedtesting.RandomizedRunner$7.evaluate(RandomizedRunner.java:863)
[junit4] 2> at
com.carrotsearch.randomizedtesting.rules.StatementAdapter.evaluate(StatementAdapter.java:36)
[junit4] 2> at
com.carrotsearch.randomizedtesting.rules.SystemPropertiesRestoreRule$1.evaluate(SystemPropertiesRestoreRule.java:57)
[junit4] 2> at
org.apache.lucene.util.AbstractBeforeAfterRule$1.evaluate(AbstractBeforeAfterRule.java:45)
[junit4] 2> at
com.carrotsearch.randomizedtesting.rules.StatementAdapter.evaluate(StatementAdapter.java:36)
[junit4] 2> at
org.apache.lucene.util.TestRuleStoreClassName$1.evaluate(TestRuleStoreClassName.java:41)
[junit4] 2> at
com.carrotsearch.randomizedtesting.rules.NoShadowingOrOverridesOnMethodsRule$1.evaluate(NoShadowingOrOverridesOnMethodsRule.java:40)
[junit4] 2> at
com.carrotsearch.randomizedtesting.rules.NoShadowingOrOverridesOnMethodsRule$1.evaluate(NoShadowingOrOverridesOnMethodsRule.java:40)
[junit4] 2> at
com.carrotsearch.randomizedtesting.rules.StatementAdapter.evaluate(StatementAdapter.java:36)
[junit4] 2> at
com.carrotsearch.randomizedtesting.rules.StatementAdapter.evaluate(StatementAdapter.java:36)
[junit4] 2> at
com.carrotsearch.randomizedtesting.rules.StatementAdapter.evaluate(StatementAdapter.java:36)
[junit4] 2> at
org.apache.lucene.util.TestRuleAssertionsRequired$1.evaluate(TestRuleAssertionsRequired.java:53)
[junit4] 2> at
org.apache.lucene.util.TestRuleMarkFailure$1.evaluate(TestRuleMarkFailure.java:47)
[junit4] 2> at
org.apache.lucene.util.TestRuleIgnoreAfterMaxFailures$1.evaluate(TestRuleIgnoreAfterMaxFailures.java:64)
[junit4] 2> at
org.apache.lucene.util.TestRuleIgnoreTestSuites$1.evaluate(TestRuleIgnoreTestSuites.java:54)
[junit4] 2> at
com.carrotsearch.randomizedtesting.rules.StatementAdapter.evaluate(StatementAdapter.java:36)
[junit4] 2> at
com.carrotsearch.randomizedtesting.ThreadLeakControl$StatementRunner.run(ThreadLeakControl.java:368)
[junit4] 2> at java.lang.Thread.run(Thread.java:748)
[junit4] 2>
[junit4] 2> 712642 INFO
(TEST-AutoCommitTest.testMaxDocs-seed#[B678C8412043B0BF]) [ x:collection1]
o.a.s.SolrTestCaseJ4 ###Ending testMaxDocs
[junit4] 2> NOTE: reproduce with: ant test -Dtestcase=AutoCommitTest
-Dtests.method=testMaxDocs -Dtests.seed=B678C8412043B0BF -Dtests.multiplier=2
-Dtests.slow=true -Dtests.locale=es-DO -Dtests.timezone=America/Detroit
-Dtests.asserts=true -Dtests.file.encoding=ISO-8859-1
[junit4] ERROR 0.39s J2 | AutoCommitTest.testMaxDocs <<<
[junit4] > Throwable #1: java.lang.RuntimeException: Exception during
query
[junit4] > at
__randomizedtesting.SeedInfo.seed([B678C8412043B0BF:FF91E9E0CA9B435]:0)
[junit4] > at
org.apache.solr.SolrTestCaseJ4.assertQ(SolrTestCaseJ4.java:886)
[junit4] > at
org.apache.solr.update.AutoCommitTest.testMaxDocs(AutoCommitTest.java:225)
[junit4] > at java.lang.Thread.run(Thread.java:748)
[junit4] > Caused by: java.lang.RuntimeException: REQUEST FAILED:
xpath=//result[@numFound=1]
[junit4] > xml response was: <?xml version="1.0" encoding="UTF-8"?>
[junit4] > <response>
[junit4] > <lst name="responseHeader"><int name="status">0</int><int
name="QTime">0</int></lst><result name="response" numFound="0"
start="0"></result>
[junit4] > </response>
[junit4] > request was:q=id:14&qt=&start=0&rows=20&version=2.2
[junit4] > at
org.apache.solr.SolrTestCaseJ4.assertQ(SolrTestCaseJ4.java:879)
[junit4] > ... 40 more
[junit4] 2> 712650 INFO (commitScheduler-2528-thread-1) [
x:collection1] o.a.s.u.DirectUpdateHandler2 start
commit{,optimize=false,openSearcher=true,waitSearcher=true,expungeDeletes=false,softCommit=true,prepareCommit=false}
[junit4] 2> 712657 INFO
(TEST-AutoCommitTest.testMaxTime-seed#[B678C8412043B0BF]) [ x:collection1]
o.a.s.SolrTestCaseJ4 ###Starting testMaxTime
[junit4] 2> 712668 INFO (commitScheduler-2528-thread-1) [
x:collection1] o.a.s.s.SolrIndexSearcher Opening
[Searcher@6809765a[collection1] main]
[junit4] 2> 712670 INFO (commitScheduler-2528-thread-1) [
x:collection1] o.a.s.u.DirectUpdateHandler2 end_commit_flush
[junit4] 2> 712670 INFO
(TEST-AutoCommitTest.testMaxTime-seed#[B678C8412043B0BF]) [ x:collection1]
o.a.s.u.DirectUpdateHandler2 [collection1] REMOVING ALL DOCUMENTS FROM INDEX
[junit4] 2> 712671 INFO
(searcherExecutor-2525-thread-1-processing-x:collection1) [ x:collection1]
o.a.s.c.SolrCore [collection1] Registered new searcher
Searcher@6809765a[collection1]
main{ExitableDirectoryReader(UninvertingDirectoryReader(Uninverting(_3(7.1.0):c16)))}
[junit4] 2> 712671 INFO
(TEST-AutoCommitTest.testMaxTime-seed#[B678C8412043B0BF]) [ x:collection1]
o.a.s.s.SolrIndexSearcher Opening [Searcher@705f596f[collection1] realtime]
[junit4] 2> 712672 INFO
(TEST-AutoCommitTest.testMaxTime-seed#[B678C8412043B0BF]) [ x:collection1]
o.a.s.u.p.LogUpdateProcessorFactory [collection1] webapp=null path=null
params={_version_=-9223372036854775807&update.distrib=FROMLEADER&versions=true&wt=json&indent=true}{deleteByQuery=*:*
(-9223372036854775807)} 0 14
[junit4] 2> 712672 ERROR
(TEST-AutoCommitTest.testMaxTime-seed#[B678C8412043B0BF]) [ x:collection1]
o.a.s.c.CorePropertiesLocator Couldn't load core descriptor from
/x1/jenkins/jenkins-slave/workspace/Lucene-Solr-Tests-7.x/solr/core/src/test-files/solr/collection1/core.properties:java.nio.file.NoSuchFileException:

/x1/jenkins/jenkins-slave/workspace/Lucene-Solr-Tests-7.x/solr/core/src/test-files/solr/collection1/core.properties
[junit4] 2> 712672 INFO
(TEST-AutoCommitTest.testMaxTime-seed#[B678C8412043B0BF]) [ x:collection1]
o.a.s.c.SolrResourceLoader [null] Added 2 libs to classloader, from paths:
[/x1/jenkins/jenkins-slave/workspace/Lucene-Solr-Tests-7.x/solr/core/src/test-files/solr/collection1/lib,

/x1/jenkins/jenkins-slave/workspace/Lucene-Solr-Tests-7.x/solr/core/src/test-files/solr/collection1/lib/classes]
[junit4] 2> 712712 INFO
(TEST-AutoCommitTest.testMaxTime-seed#[B678C8412043B0BF]) [ x:collection1]
o.a.s.c.SolrConfig Using Lucene MatchVersion: 7.1.0
[junit4] 2> 712733 INFO
(TEST-AutoCommitTest.testMaxTime-seed#[B678C8412043B0BF]) [ x:collection1]
o.a.s.s.IndexSchema [collection1] Schema name=test
[junit4] 2> 712844 INFO
(TEST-AutoCommitTest.testMaxTime-seed#[B678C8412043B0BF]) [ x:collection1]
o.a.s.s.IndexSchema Loaded schema test/1.0 with uniqueid field id
[junit4] 2> 712852 INFO
(TEST-AutoCommitTest.testMaxTime-seed#[B678C8412043B0BF]) [ x:collection1]
o.a.s.c.CoreContainer Reloading SolrCore 'collection1' using configuration from
instancedir
/x1/jenkins/jenkins-slave/workspace/Lucene-Solr-Tests-7.x/solr/core/src/test-files/solr/collection1
[junit4] 2> 712867 INFO
(TEST-AutoCommitTest.testMaxTime-seed#[B678C8412043B0BF]) [ x:collection1]
o.a.s.m.r.SolrJmxReporter JMX monitoring for 'solr.core.collection1' (registry
'solr.core.collection1') enabled at server:
com.sun.jmx.mbeanserver.JmxMBeanServer@65a82801
[junit4] 2> 712868 INFO
(TEST-AutoCommitTest.testMaxTime-seed#[B678C8412043B0BF]) [ x:collection1]
o.a.s.c.SolrCore [[collection1] ] Opening new SolrCore at
[/x1/jenkins/jenkins-slave/workspace/Lucene-Solr-Tests-7.x/solr/core/src/test-files/solr/collection1],

dataDir=[/x1/jenkins/jenkins-slave/workspace/Lucene-Solr-Tests-7.x/solr/build/solr-core/test/J2/temp/solr.update.AutoCommitTest_B678C8412043B0BF-001/init-core-data-001/]
[junit4] 2> 712910 INFO
(TEST-AutoCommitTest.testMaxTime-seed#[B678C8412043B0BF]) [ x:collection1]
o.a.s.u.CommitTracker Hard AutoCommit: disabled
[junit4] 2> 712910 INFO
(TEST-AutoCommitTest.testMaxTime-seed#[B678C8412043B0BF]) [ x:collection1]
o.a.s.u.CommitTracker Soft AutoCommit: disabled
[junit4] 2> 712911 INFO
(TEST-AutoCommitTest.testMaxTime-seed#[B678C8412043B0BF]) [ x:collection1]
o.a.s.s.SolrIndexSearcher Opening [Searcher@71693da8[collection1] main]
[junit4] 2> 712912 INFO
(TEST-AutoCommitTest.testMaxTime-seed#[B678C8412043B0BF]) [ x:collection1]
o.a.s.h.c.SpellCheckComponent Initializing spell checkers
[junit4] 2> 712914 INFO
(TEST-AutoCommitTest.testMaxTime-seed#[B678C8412043B0BF]) [ x:collection1]
o.a.s.s.DirectSolrSpellChecker init:
{name=direct,classname=DirectSolrSpellChecker,field=lowerfilt,minQueryLength=3}
[junit4] 2> 712917 INFO
(TEST-AutoCommitTest.testMaxTime-seed#[B678C8412043B0BF]) [ x:collection1]
o.a.s.h.ReplicationHandler Commits will be reserved for 10000
[junit4] 2> 712929 INFO
(searcherExecutor-2529-thread-1-processing-x:collection1) [ x:collection1]
o.a.s.h.c.SpellCheckComponent Loading spell index for spellchecker: default
[junit4] 2> 712930 INFO
(searcherExecutor-2529-thread-1-processing-x:collection1) [ x:collection1]
o.a.s.h.c.SpellCheckComponent Loading spell index for spellchecker: direct
[junit4] 2> 712930 INFO
(searcherExecutor-2529-thread-1-processing-x:collection1) [ x:collection1]
o.a.s.h.c.SpellCheckComponent Loading spell index for spellchecker: wordbreak
[junit4] 2> 712930 INFO
(searcherExecutor-2529-thread-1-processing-x:collection1) [ x:collection1]
o.a.s.h.c.SpellCheckComponent Loading spell index for spellchecker:
multipleFields
[junit4] 2> 712930 INFO
(searcherExecutor-2529-thread-1-processing-x:collection1) [ x:collection1]
o.a.s.h.c.SpellCheckComponent Loading spell index for spellchecker: jarowinkler
[junit4] 2> 712930 INFO
(searcherExecutor-2529-thread-1-processing-x:collection1) [ x:collection1]
o.a.s.h.c.SpellCheckComponent Loading spell index for spellchecker: external
[junit4] 2> 712931 INFO
(TEST-AutoCommitTest.testMaxTime-seed#[B678C8412043B0BF]) [ x:collection1]
o.a.s.u.RandomMergePolicy RandomMergePolicy wrapping class
org.apache.lucene.index.LogByteSizeMergePolicy: [LogByteSizeMergePolicy:
minMergeSize=1677721, mergeFactor=10, maxMergeSize=2147483648,
maxMergeSizeForForcedMerge=9223372036854775807, calibrateSizeByDeletes=true,
maxMergeDocs=2147483647, maxCFSSegmentSizeMB=8.796093022207999E12,
noCFSRatio=0.0]
[junit4] 2> 712931 INFO
(searcherExecutor-2529-thread-1-processing-x:collection1) [ x:collection1]
o.a.s.h.c.SpellCheckComponent Loading spell index for spellchecker: freq
[junit4] 2> 712932 INFO
(searcherExecutor-2529-thread-1-processing-x:collection1) [ x:collection1]
o.a.s.h.c.SpellCheckComponent Loading spell index for spellchecker: fqcn
[junit4] 2> 712932 INFO
(searcherExecutor-2529-thread-1-processing-x:collection1) [ x:collection1]
o.a.s.h.c.SpellCheckComponent Loading spell index for spellchecker: perDict
[junit4] 2> 712937 INFO
(TEST-AutoCommitTest.testMaxTime-seed#[B678C8412043B0BF]) [ x:collection1]
o.a.s.u.DefaultSolrCoreState New IndexWriter is ready to be used.
[junit4] 2> 712938 INFO
(searcherExecutor-2529-thread-1-processing-x:collection1) [ x:collection1]
o.a.s.c.SolrCore [collection1] Registered new searcher
Searcher@71693da8[collection1]
main{ExitableDirectoryReader(UninvertingDirectoryReader())}
[junit4] 2> 712938 INFO
(TEST-AutoCommitTest.testMaxTime-seed#[B678C8412043B0BF]) [ x:collection1]
o.a.s.s.SolrIndexSearcher Opening [Searcher@6c3b0a84[collection1] main]
[junit4] 2> 712938 INFO
(TEST-AutoCommitTest.testMaxTime-seed#[B678C8412043B0BF]) [ x:collection1]
o.a.s.c.SolrCore [collection1] CLOSING SolrCore
org.apache.solr.core.SolrCore@51dbc20d
[junit4] 2> 712939 INFO
(TEST-AutoCommitTest.testMaxTime-seed#[B678C8412043B0BF]) [ x:collection1]
o.a.s.m.SolrMetricManager Closing metric reporters for
registry=solr.core.collection1, tag=1373356557
[junit4] 2> 712945 INFO
(searcherExecutor-2529-thread-1-processing-x:collection1) [ x:collection1]
o.a.s.c.SolrCore [collection1] Registered new searcher
Searcher@6c3b0a84[collection1]
main{ExitableDirectoryReader(UninvertingDirectoryReader())}
[junit4] 2> 712953 INFO
(TEST-AutoCommitTest.testMaxTime-seed#[B678C8412043B0BF]) [ x:collection1]
o.a.s.u.p.LogUpdateProcessorFactory [collection1] {add=[529
(1575605561228001280)]} 0 9
[junit4] 2> 712954 INFO
(TEST-AutoCommitTest.testMaxTime-seed#[B678C8412043B0BF]) [ x:collection1]
o.a.s.c.S.Request [collection1] webapp=null path=null
params={q=id:529&qt=&start=0&rows=20&version=2.2} hits=0 status=0 QTime=0
[junit4] 2> 712962 INFO
(TEST-AutoCommitTest.testMaxTime-seed#[B678C8412043B0BF]) [ x:collection1]
o.a.s.u.p.LogUpdateProcessorFactory [collection1] {add=[530
(1575605561245827072)]} 0 17
[junit4] 2> 712962 INFO
(TEST-AutoCommitTest.testMaxTime-seed#[B678C8412043B0BF]) [ x:collection1]
o.a.s.c.S.Request [collection1] webapp=null path=null
params={q=id:529&qt=&start=0&rows=20&version=2.2} hits=0 status=0 QTime=0
[junit4] 2> 712962 ERROR
(TEST-AutoCommitTest.testMaxTime-seed#[B678C8412043B0BF]) [ x:collection1]
o.a.s.SolrTestCaseJ4 REQUEST FAILED: xpath=//result[@numFound=1]
[junit4] 2> xml response was: <?xml version="1.0" encoding="UTF-8"?>
[junit4] 2> <response>
[junit4] 2> <lst name="responseHeader"><int name="status">0</int><int
name="QTime">0</int></lst><result name="response" numFound="0"
start="0"></result>
[junit4] 2> </response>
[junit4] 2>
[junit4] 2> request was:q=id:529&qt=&start=0&rows=20&version=2.2
[junit4] 2> 712963 ERROR
(TEST-AutoCommitTest.testMaxTime-seed#[B678C8412043B0BF]) [ x:collection1]
o.a.s.SolrTestCaseJ4 REQUEST FAILED:
q=id:529&qt=&start=0&rows=20&version=2.2:java.lang.RuntimeException: REQUEST
FAILED: xpath=//result[@numFound=1]
[junit4] 2> xml response was: <?xml version="1.0" encoding="UTF-8"?>
[junit4] 2> <response>
[junit4] 2> <lst name="responseHeader"><int name="status">0</int><int
name="QTime">0</int></lst><result name="response" numFound="0"
start="0"></result>
[junit4] 2> </response>
[junit4] 2>
[junit4] 2> request was:q=id:529&qt=&start=0&rows=20&version=2.2
[junit4] 2> at
org.apache.solr.SolrTestCaseJ4.assertQ(SolrTestCaseJ4.java:879)
[junit4] 2> at
org.apache.solr.update.AutoCommitTest.testMaxTime(AutoCommitTest.java:270)
[junit4] 2> at sun.reflect.NativeMethodAccessorImpl.invoke0(Native
Method)
[junit4] 2> at
sun.reflect.NativeMethodAccessorImpl.invoke(NativeMethodAccessorImpl.java:62)
[junit4] 2> at
sun.reflect.DelegatingMethodAccessorImpl.invoke(DelegatingMethodAccessorImpl.java:43)
[junit4] 2> at java.lang.reflect.Method.invoke(Method.java:498)
[junit4] 2> at
com.carrotsearch.randomizedtesting.RandomizedRunner.invoke(RandomizedRunner.java:1713)
[junit4] 2> at
com.carrotsearch.randomizedtesting.RandomizedRunner$8.evaluate(RandomizedRunner.java:907)
[junit4] 2> at
com.carrotsearch.randomizedtesting.RandomizedRunner$9.evaluate(RandomizedRunner.java:943)
[junit4] 2> at
com.carrotsearch.randomizedtesting.RandomizedRunner$10.evaluate(RandomizedRunner.java:957)
[junit4] 2> at
com.carrotsearch.randomizedtesting.rules.SystemPropertiesRestoreRule$1.evaluate(SystemPropertiesRestoreRule.java:57)
[junit4] 2> at
org.apache.lucene.util.TestRuleSetupTeardownChained$1.evaluate(TestRuleSetupTeardownChained.java:49)
[junit4] 2> at
org.apache.lucene.util.AbstractBeforeAfterRule$1.evaluate(AbstractBeforeAfterRule.java:45)
[junit4] 2> at
org.apache.lucene.util.TestRuleThreadAndTestName$1.evaluate(TestRuleThreadAndTestName.java:48)
[junit4] 2> at
org.apache.lucene.util.TestRuleIgnoreAfterMaxFailures$1.evaluate(TestRuleIgnoreAfterMaxFailures.java:64)
[junit4] 2> at
org.apache.lucene.util.TestRuleMarkFailure$1.evaluate(TestRuleMarkFailure.java:47)
[junit4] 2> at
com.carrotsearch.randomizedtesting.rules.StatementAdapter.evaluate(StatementAdapter.java:36)
[junit4] 2> at
com.carrotsearch.randomizedtesting.ThreadLeakControl$StatementRunner.run(ThreadLeakControl.java:368)
[junit4] 2> at
com.carrotsearch.randomizedtesting.ThreadLeakControl.forkTimeoutingTask(ThreadLeakControl.java:817)
[junit4] 2> at
com.carrotsearch.randomizedtesting.ThreadLeakControl$3.evaluate(ThreadLeakControl.java:468)
[junit4] 2> at
com.carrotsearch.randomizedtesting.RandomizedRunner.runSingleTest(RandomizedRunner.java:916)
[junit4] 2> at
com.carrotsearch.randomizedtesting.RandomizedRunner$5.evaluate(RandomizedRunner.java:802)
[junit4] 2> at
com.carrotsearch.randomizedtesting.RandomizedRunner$6.evaluate(RandomizedRunner.java:852)
[junit4] 2> at
com.carrotsearch.randomizedtesting.RandomizedRunner$7.evaluate(RandomizedRunner.java:863)
[junit4] 2> at
com.carrotsearch.randomizedtesting.rules.StatementAdapter.evaluate(StatementAdapter.java:36)
[junit4] 2> at
com.carrotsearch.randomizedtesting.rules.SystemPropertiesRestoreRule$1.evaluate(SystemPropertiesRestoreRule.java:57)
[junit4] 2> at
org.apache.lucene.util.AbstractBeforeAfterRule$1.evaluate(AbstractBeforeAfterRule.java:45)
[junit4] 2> at
com.carrotsearch.randomizedtesting.rules.StatementAdapter.evaluate(StatementAdapter.java:36)
[junit4] 2> at
org.apache.lucene.util.TestRuleStoreClassName$1.evaluate(TestRuleStoreClassName.java:41)
[junit4] 2> at
com.carrotsearch.randomizedtesting.rules.NoShadowingOrOverridesOnMethodsRule$1.evaluate(NoShadowingOrOverridesOnMethodsRule.java:40)
[junit4] 2> at
com.carrotsearch.randomizedtesting.rules.NoShadowingOrOverridesOnMethodsRule$1.evaluate(NoShadowingOrOverridesOnMethodsRule.java:40)
[junit4] 2> at
com.carrotsearch.randomizedtesting.rules.StatementAdapter.evaluate(StatementAdapter.java:36)
[junit4] 2> at
com.carrotsearch.randomizedtesting.rules.StatementAdapter.evaluate(StatementAdapter.java:36)
[junit4] 2> at
com.carrotsearch.randomizedtesting.rules.StatementAdapter.evaluate(StatementAdapter.java:36)
[junit4] 2> at
org.apache.lucene.util.TestRuleAssertionsRequired$1.evaluate(TestRuleAssertionsRequired.java:53)
[junit4] 2> at
org.apache.lucene.util.TestRuleMarkFailure$1.evaluate(TestRuleMarkFailure.java:47)
[junit4] 2> at
org.apache.lucene.util.TestRuleIgnoreAfterMaxFailures$1.evaluate(TestRuleIgnoreAfterMaxFailures.java:64)
[junit4] 2> at
org.apache.lucene.util.TestRuleIgnoreTestSuites$1.evaluate(TestRuleIgnoreTestSuites.java:54)
[junit4] 2> at
com.carrotsearch.randomizedtesting.rules.StatementAdapter.evaluate(StatementAdapter.java:36)
[junit4] 2> at
com.carrotsearch.randomizedtesting.ThreadLeakControl$StatementRunner.run(ThreadLeakControl.java:368)
[junit4] 2> at java.lang.Thread.run(Thread.java:748)
[junit4] 2>
[junit4] 2> 712963 INFO
(TEST-AutoCommitTest.testMaxTime-seed#[B678C8412043B0BF]) [ x:collection1]
o.a.s.SolrTestCaseJ4 ###Ending testMaxTime
[junit4] 2> NOTE: reproduce with: ant test -Dtestcase=AutoCommitTest
-Dtests.method=testMaxTime -Dtests.seed=B678C8412043B0BF -Dtests.multiplier=2
-Dtests.slow=true -Dtests.locale=es-DO -Dtests.timezone=America/Detroit
-Dtests.asserts=true -Dtests.file.encoding=ISO-8859-1
[junit4] ERROR 0.32s J2 | AutoCommitTest.testMaxTime <<<
[junit4] > Throwable #1: java.lang.RuntimeException: Exception during
query
[junit4] > at
__randomizedtesting.SeedInfo.seed([B678C8412043B0BF:2C8CB5A3BED92C83]:0)
[junit4] > at
org.apache.solr.SolrTestCaseJ4.assertQ(SolrTestCaseJ4.java:886)
[junit4] > at
org.apache.solr.update.AutoCommitTest.testMaxTime(AutoCommitTest.java:270)
[junit4] > at java.lang.Thread.run(Thread.java:748)
[junit4] > Caused by: java.lang.RuntimeException: REQUEST FAILED:
xpath=//result[@numFound=1]
[junit4] > xml response was: <?xml version="1.0" encoding="UTF-8"?>
[junit4] > <response>
[junit4] > <lst name="responseHeader"><int name="status">0</int><int
name="QTime">0</int></lst><result name="response" numFound="0"
start="0"></result>
[junit4] > </response>
[junit4] > request was:q=id:529&qt=&start=0&rows=20&version=2.2
[junit4] > at
org.apache.solr.SolrTestCaseJ4.assertQ(SolrTestCaseJ4.java:879)
[junit4] > ... 40 more
[junit4] 2> 712965 INFO
(SUITE-AutoCommitTest-seed#[B678C8412043B0BF]-worker) [ x:collection1]
o.a.s.SolrTestCaseJ4 ###deleteCore
[junit4] 2> 712965 INFO
(SUITE-AutoCommitTest-seed#[B678C8412043B0BF]-worker) [ x:collection1]
o.a.s.c.CoreContainer Shutting down CoreContainer instance=1293576299
[junit4] 2> 712965 INFO
(SUITE-AutoCommitTest-seed#[B678C8412043B0BF]-worker) [ x:collection1]
o.a.s.m.SolrMetricManager Closing metric reporters for registry=solr.node,
tag=null
[junit4] 2> 712966 INFO
(SUITE-AutoCommitTest-seed#[B678C8412043B0BF]-worker) [ x:collection1]
o.a.s.m.SolrMetricManager Closing metric reporters for registry=solr.jvm,
tag=null
[junit4] 2> 712967 INFO
(SUITE-AutoCommitTest-seed#[B678C8412043B0BF]-worker) [ x:collection1]
o.a.s.m.SolrMetricManager Closing metric reporters for registry=solr.jetty,
tag=null
[junit4] 2> 712973 INFO
(SUITE-AutoCommitTest-seed#[B678C8412043B0BF]-worker) [ x:collection1]
o.a.s.c.TransientSolrCoreCacheDefault Allocating transient cache for 2147483647
transient cores
[junit4] 2> 712985 INFO
(coreCloseExecutor-2533-thread-1-processing-x:collection1) [ x:collection1]
o.a.s.c.SolrCore [collection1] CLOSING SolrCore
org.apache.solr.core.SolrCore@398baa2a
[junit4] 2> 712985 INFO
(coreCloseExecutor-2533-thread-1-processing-x:collection1) [ x:collection1]
o.a.s.u.DirectUpdateHandler2 Committing on IndexWriter close.
[junit4] 2> 712985 INFO
(coreCloseExecutor-2533-thread-1-processing-x:collection1) [ x:collection1]
o.a.s.u.SolrIndexWriter Calling setCommitData with
IW:org.apache.solr.update.SolrIndexWriter@7d50ceb2 commitCommandVersion:0
[junit4] 2> 712994 INFO
(coreCloseExecutor-2533-thread-1-processing-x:collection1) [ x:collection1]
o.a.s.m.SolrMetricManager Closing metric reporters for
registry=solr.core.collection1, tag=965454378
[junit4] 2> NOTE: leaving temporary files on disk at:
/x1/jenkins/jenkins-slave/workspace/Lucene-Solr-Tests-7.x/solr/build/solr-core/test/J2/temp/solr.update.AutoCommitTest_B678C8412043B0BF-001
[junit4] 2> Aug 13, 2017 8:55:56 AM
com.carrotsearch.randomizedtesting.ThreadLeakControl checkThreadLeaks
[junit4] 2> WARNING: Will linger awaiting termination of 1 leaked
thread(s).
[junit4] 2> NOTE: test params are: codec=Asserting(Lucene70),
sim=RandomSimilarity(queryNorm=true): {}, locale=es-DO, timezone=America/Detroit
[junit4] 2> NOTE: Linux 3.13.0-88-generic amd64/Oracle Corporation
1.8.0_144 (64-bit)/cpus=4,threads=1,free=205970752,total=523239424
[junit4] 2> NOTE: All tests run in this JVM: [SuggesterFSTTest,
TlogReplayBufferedWhileIndexingTest, BadIndexSchemaTest,
OverseerModifyCollectionTest, TestRuleBasedAuthorizationPlugin,
CdcrReplicationDistributedZkTest, TestPerFieldSimilarityWithDefaultOverride,
SolrCoreMetricManagerTest, HdfsCollectionsAPIDistributedZkTest,
TestCloudPivotFacet, NumericFieldsTest, TestRandomCollapseQParserPlugin,
ZkStateReaderTest, TimeZoneUtilsTest, UnloadDistributedZkTest,
TestFieldCollectionResource, SignatureUpdateProcessorFactoryTest,
ClassificationUpdateProcessorIntegrationTest, TestSimpleQParserPlugin,
TestCloudDeleteByQuery, SolrTestCaseJ4Test, RegexBoostProcessorTest,
SortByFunctionTest, PreAnalyzedUpdateProcessorTest,
TestCopyFieldCollectionResource, TestCollectionsAPIViaSolrCloudCluster,
DistributedQueryComponentCustomSortTest, TestSolrCloudWithDelegationTokens,
UniqFieldsUpdateProcessorFactoryTest, TestSort, DistribJoinFromCollectionTest,
TestConfigSets, TestNestedDocsSort, TestRecovery, TestPushWriter,
TestStressUserVersions, SolrMetricsIntegrationTest, CircularListTest,
PrimitiveFieldTypeTest, TestCollapseQParserPlugin,
CollectionsAPIAsyncDistributedZkTest, TestDistribIDF, TestFieldCacheSortRandom,
ShufflingReplicaListTransformerTest, RuleEngineTest,
TestMiniSolrCloudClusterSSL, HdfsRecoveryZkTest, QueryEqualityTest,
HttpSolrCallGetCoreTest, CdcrVersionReplicationTest,
TestSuggestSpellingConverter, TestJmxIntegration, TestConfigSetsAPIZkFailure,
DateMathParserTest, TestCustomSort, TestTolerantSearch,
TestGraphTermsQParserPlugin, DistributedFacetExistsSmallTest,
AsyncCallRequestStatusResponseTest, MinimalSchemaTest,
TestManagedSynonymGraphFilterFactory, TestMinMaxOnMultiValuedField, TestUtils,
TestSolrQueryResponse, DistanceUnitsTest, FastVectorHighlighterTest,
TestJettySolrRunner, PolyFieldTest, RemoteQueryErrorTest,
TestSQLHandlerNonCloud, PKIAuthenticationIntegrationTest,
TestSubQueryTransformerCrossCore, SaslZkACLProviderTest,
TestDFRSimilarityFactory, OverseerTest, LeaderElectionTest, JavabinLoaderTest,
AutoCommitTest]
[junit4] Completed [198/728 (1!)] on J2 in 9.48s, 3 tests, 2 errors <<<
FAILURES!

[...truncated 45068 lines...]

---------------------------------------------------------------------
To unsubscribe, e-mail: dev-unsubscribe@xxxxxxxxxxxxxxxxx
For additional commands, e-mail: dev-help@xxxxxxxxxxxxxxxxx



Programming list archiving by: Enterprise Git Hosting