git.net

[Date Prev][Date Next][Thread Prev][Thread Next][Date Index][Thread Index]

[Bug 62557] CMake MSVC build started to fail on linking mod_lbmethod_bybusyness


https://bz.apache.org/bugzilla/show_bug.cgi?id=62557

--- Comment #9 from Michal Karm Babacek <michal.babacek@xxxxxxxxx> ---
Using trunk +  r1832855 seems to work for me just fine. The build runs right
through mod_proxy stuff and it hits a completely different issue most likely
related to my OpenSSL 1_0_2n being probably too old for mod_ssl's trunk? I'll
look into the doc and see...

> [ 95%] Linking C shared library mod_ssl.so
>    Creating library mod_ssl.lib and object mod_ssl.exp
> ssl_engine_init.c.obj : error LNK2019: unresolved external
> symbol modssl_load_engine_keypair referenced in function ssl_init_server_certs
> mod_ssl.so : fatal error LNK1120: 1 unresolved externals
> LINK Pass 1 failed. with 1120
> NMAKE : fatal error U1077: '"C:\Program Files\CMake\bin\cmake.exe"' : return code '0xffffffff'

-- 
You are receiving this mail because:
You are the assignee for the bug.
---------------------------------------------------------------------
To unsubscribe, e-mail: bugs-unsubscribe@xxxxxxxxxxxxxxxx
For additional commands, e-mail: bugs-help@xxxxxxxxxxxxxxxx




( ! ) Warning: include(msgfooter.php): failed to open stream: No such file or directory in /var/www/git/apache2-bugs/msg03035.html on line 92
Call Stack
#TimeMemoryFunctionLocation
10.0006363512{main}( ).../msg03035.html:0

( ! ) Warning: include(): Failed opening 'msgfooter.php' for inclusion (include_path='.:/var/www/git') in /var/www/git/apache2-bugs/msg03035.html on line 92
Call Stack
#TimeMemoryFunctionLocation
10.0006363512{main}( ).../msg03035.html:0