git.net

[Date Prev][Date Next][Thread Prev][Thread Next][Date Index][Thread Index]

Re: Build CloudStack 4.10.0 Error


Hi,
Edit your /usr/lib/jvm/java-1.7.0/jre/lib/security/java.security and replace the line starting with : 
jdk.tls.disabledAlgorithms= XXXXX

by

jdk.tls.disabledAlgorithms=DH keySize < 128, RSA keySize < 128, \
    DES keySize < 128, SHA1 keySize < 128, MD5 keySize < 128, RC4


Best regards

----- Mail original -----
> De: "li jerry" <div8cn@xxxxxxxxxxx>
> À: users@xxxxxxxxxxxxxxxxxxxxx, dev@xxxxxxxxxxxxxxxxxxxxx
> Envoyé: Mardi 13 Novembre 2018 16:34:34
> Objet: Build CloudStack 4.10.0 Error

> Hi All
> 
>       I made a mistake in compiling cloudstack 4.10.0 through docker image
>       (khos2ow/cloudstack-deb-builder: 14.04).
> 
> Please help me. Thank you!
> 
> -------------------------------------------------------
> T E S T S
> -------------------------------------------------------
> Running streamer.BaseElementTest
> Tests run: 1, Failures: 0, Errors: 0, Skipped: 0, Time elapsed: 0.103 sec - in
> streamer.BaseElementTest
> Running streamer.ByteBufferTest
> Tests run: 400, Failures: 0, Errors: 0, Skipped: 0, Time elapsed: 0.091 sec - in
> streamer.ByteBufferTest
> Running rdpclient.MockServerTest
> Error in mock server: Received fatal alert: handshake_failure
> javax.net.ssl.SSLHandshakeException: Received fatal alert: handshake_failure
>       at sun.security.ssl.Alerts.getSSLException(Alerts.java:192)
>       at sun.security.ssl.Alerts.getSSLException(Alerts.java:154)
>       at sun.security.ssl.SSLSocketImpl.recvAlert(SSLSocketImpl.java:2038)
>       at sun.security.ssl.SSLSocketImpl.readRecord(SSLSocketImpl.java:1135)
>       at
>       sun.security.ssl.SSLSocketImpl.performInitialHandshake(SSLSocketImpl.java:1385)
>       at sun.security.ssl.SSLSocketImpl.startHandshake(SSLSocketImpl.java:1413)
>       at sun.security.ssl.SSLSocketImpl.startHandshake(SSLSocketImpl.java:1397)
>       at streamer.debug.MockServer.run(MockServer.java:122)
>       at java.lang.Thread.run(Thread.java:748)
> Tests run: 2, Failures: 0, Errors: 1, Skipped: 0, Time elapsed: 0.186 sec <<<
> FAILURE! - in rdpclient.MockServerTest
> testIsMockServerCanUpgradeConnectionToSsl(rdpclient.MockServerTest)  Time
> elapsed: 0.18 sec  <<< ERROR!
> javax.net.ssl.SSLHandshakeException: No appropriate protocol (protocol is
> disabled or cipher suites are inappropriate)
>       at sun.security.ssl.Handshaker.activate(Handshaker.java:529)
>       at sun.security.ssl.SSLSocketImpl.kickstartHandshake(SSLSocketImpl.java:1492)
>       at
>       sun.security.ssl.SSLSocketImpl.performInitialHandshake(SSLSocketImpl.java:1361)
>       at sun.security.ssl.SSLSocketImpl.startHandshake(SSLSocketImpl.java:1413)
>       at sun.security.ssl.SSLSocketImpl.startHandshake(SSLSocketImpl.java:1397)
>       at
>       rdpclient.MockServerTest.testIsMockServerCanUpgradeConnectionToSsl(MockServerTest.java:166)
> 
> Running common.ClientTest
> Tests run: 1, Failures: 0, Errors: 0, Skipped: 0, Time elapsed: 0.262 sec - in
> common.ClientTest
> 
> Results :
> 
> Tests in error:
>  MockServerTest.testIsMockServerCanUpgradeConnectionToSsl:166 ? SSLHandshake
>  No...
> 
> Tests run: 404, Failures: 0, Errors: 1, Skipped: 0