git.net

[Date Prev][Date Next][Thread Prev][Thread Next][Date Index][Thread Index]

Build failed in Jenkins: brooklyn-master-build-docker #1190


See <https://builds.apache.org/job/brooklyn-master-build-docker/1190/display/redirect>

------------------------------------------
[...truncated 6.13 MB...]
2018-12-23 00:22:01,113 INFO  - TESTNG PASSED CONFIGURATION: "Surefire test" - @BeforeMethod org.apache.brooklyn.core.test.BrooklynAppUnitTestSupport.setUp() finished in 11 ms
2018-12-23 00:22:01,113 INFO  - TESTNG INVOKING CONFIGURATION: "Surefire test" - @BeforeMethod org.apache.brooklyn.core.sensor.password.CreatePasswordSensorTest.setup()
2018-12-23 00:22:01,143 INFO  - TESTNG PASSED CONFIGURATION: "Surefire test" - @BeforeMethod org.apache.brooklyn.core.sensor.password.CreatePasswordSensorTest.setup() finished in 30 ms
2018-12-23 00:22:01,143 INFO  - TESTNG INVOKING: "Surefire test" - org.apache.brooklyn.core.sensor.password.CreatePasswordSensorTest.testCreatePasswordCharacterGroups()
2018-12-23 00:22:01,147 INFO  - TESTNG PASSED: "Surefire test" - org.apache.brooklyn.core.sensor.password.CreatePasswordSensorTest.testCreatePasswordCharacterGroups() finished in 4 ms
2018-12-23 00:22:01,148 INFO  - TESTNG INVOKING CONFIGURATION: "Surefire test" - @AfterMethod org.apache.brooklyn.core.test.BrooklynMgmtUnitTestSupport.tearDown()
2018-12-23 00:22:01,152 INFO  - TESTNG PASSED CONFIGURATION: "Surefire test" - @AfterMethod org.apache.brooklyn.core.test.BrooklynMgmtUnitTestSupport.tearDown() finished in 4 ms
2018-12-23 00:22:01,153 INFO  - TESTNG INVOKING CONFIGURATION: "Surefire test" - @BeforeMethod org.apache.brooklyn.core.test.BrooklynAppUnitTestSupport.setUp()
2018-12-23 00:22:01,153 INFO  - Added external config supplier named 'brooklyn-demo-sample': org.apache.brooklyn.core.config.external.InPlaceExternalConfigSupplier@6479ece8
2018-12-23 00:22:01,163 INFO  - TESTNG PASSED CONFIGURATION: "Surefire test" - @BeforeMethod org.apache.brooklyn.core.test.BrooklynAppUnitTestSupport.setUp() finished in 10 ms
2018-12-23 00:22:01,163 INFO  - TESTNG INVOKING CONFIGURATION: "Surefire test" - @BeforeMethod org.apache.brooklyn.core.sensor.password.CreatePasswordSensorTest.setup()
2018-12-23 00:22:01,192 INFO  - TESTNG PASSED CONFIGURATION: "Surefire test" - @BeforeMethod org.apache.brooklyn.core.sensor.password.CreatePasswordSensorTest.setup() finished in 29 ms
2018-12-23 00:22:01,192 INFO  - TESTNG INVOKING: "Surefire test" - org.apache.brooklyn.core.sensor.password.CreatePasswordSensorTest.testCreatePasswordCreatesAPasswordOfDefaultLength()
2018-12-23 00:22:01,192 INFO  - TESTNG PASSED: "Surefire test" - org.apache.brooklyn.core.sensor.password.CreatePasswordSensorTest.testCreatePasswordCreatesAPasswordOfDefaultLength() finished in 0 ms
2018-12-23 00:22:01,193 INFO  - TESTNG INVOKING CONFIGURATION: "Surefire test" - @AfterMethod org.apache.brooklyn.core.test.BrooklynMgmtUnitTestSupport.tearDown()
2018-12-23 00:22:01,197 INFO  - TESTNG PASSED CONFIGURATION: "Surefire test" - @AfterMethod org.apache.brooklyn.core.test.BrooklynMgmtUnitTestSupport.tearDown() finished in 4 ms
2018-12-23 00:22:01,197 INFO  - TESTNG INVOKING CONFIGURATION: "Surefire test" - @BeforeMethod org.apache.brooklyn.core.test.BrooklynAppUnitTestSupport.setUp()
2018-12-23 00:22:01,198 INFO  - Added external config supplier named 'brooklyn-demo-sample': org.apache.brooklyn.core.config.external.InPlaceExternalConfigSupplier@4f8409c0
2018-12-23 00:22:01,208 INFO  - TESTNG PASSED CONFIGURATION: "Surefire test" - @BeforeMethod org.apache.brooklyn.core.test.BrooklynAppUnitTestSupport.setUp() finished in 11 ms
2018-12-23 00:22:01,208 INFO  - TESTNG INVOKING: "Surefire test" - org.apache.brooklyn.core.sensor.DurationSinceSensorTest.testSensorAddedAndUpdated()
2018-12-23 00:22:01,279 INFO  - TESTNG PASSED: "Surefire test" - org.apache.brooklyn.core.sensor.DurationSinceSensorTest.testSensorAddedAndUpdated() finished in 71 ms
2018-12-23 00:22:01,279 INFO  - TESTNG INVOKING CONFIGURATION: "Surefire test" - @AfterMethod org.apache.brooklyn.core.test.BrooklynMgmtUnitTestSupport.tearDown()
2018-12-23 00:22:01,284 INFO  - TESTNG PASSED CONFIGURATION: "Surefire test" - @AfterMethod org.apache.brooklyn.core.test.BrooklynMgmtUnitTestSupport.tearDown() finished in 5 ms
2018-12-23 00:22:01,285 INFO  - TESTNG INVOKING CONFIGURATION: "Surefire test" - @BeforeMethod org.apache.brooklyn.core.sensor.http.HttpRequestSensorTest.setUp()
2018-12-23 00:22:01,287 INFO  - Added external config supplier named 'brooklyn-demo-sample': org.apache.brooklyn.core.config.external.InPlaceExternalConfigSupplier@27c823d9
2018-12-23 00:22:01,323 INFO  - TESTNG PASSED CONFIGURATION: "Surefire test" - @BeforeMethod org.apache.brooklyn.core.sensor.http.HttpRequestSensorTest.setUp() finished in 38 ms
2018-12-23 00:22:01,323 INFO  - TESTNG INVOKING: "Surefire test" - org.apache.brooklyn.core.sensor.http.HttpRequestSensorTest.testDoNotParseJson()
2018-12-23 00:22:01,368 INFO  - TESTNG PASSED: "Surefire test" - org.apache.brooklyn.core.sensor.http.HttpRequestSensorTest.testDoNotParseJson() finished in 45 ms
2018-12-23 00:22:01,368 INFO  - TESTNG INVOKING CONFIGURATION: "Surefire test" - @AfterMethod org.apache.brooklyn.core.sensor.http.HttpRequestSensorTest.tearDown()
2018-12-23 00:22:01,374 INFO  - TESTNG PASSED CONFIGURATION: "Surefire test" - @AfterMethod org.apache.brooklyn.core.sensor.http.HttpRequestSensorTest.tearDown() finished in 6 ms
2018-12-23 00:22:01,374 INFO  - TESTNG INVOKING CONFIGURATION: "Surefire test" - @BeforeMethod org.apache.brooklyn.core.sensor.http.HttpRequestSensorTest.setUp()
2018-12-23 00:22:01,375 INFO  - Added external config supplier named 'brooklyn-demo-sample': org.apache.brooklyn.core.config.external.InPlaceExternalConfigSupplier@386a7bf4
2018-12-23 00:22:01,414 INFO  - TESTNG PASSED CONFIGURATION: "Surefire test" - @BeforeMethod org.apache.brooklyn.core.sensor.http.HttpRequestSensorTest.setUp() finished in 40 ms
2018-12-23 00:22:01,414 INFO  - TESTNG INVOKING: "Surefire test" - org.apache.brooklyn.core.sensor.http.HttpRequestSensorTest.testHttpSensor()
2018-12-23 00:22:01,422 INFO  - TESTNG PASSED: "Surefire test" - org.apache.brooklyn.core.sensor.http.HttpRequestSensorTest.testHttpSensor() finished in 8 ms
2018-12-23 00:22:01,422 INFO  - TESTNG INVOKING CONFIGURATION: "Surefire test" - @AfterMethod org.apache.brooklyn.core.sensor.http.HttpRequestSensorTest.tearDown()
2018-12-23 00:22:01,427 INFO  - TESTNG PASSED CONFIGURATION: "Surefire test" - @AfterMethod org.apache.brooklyn.core.sensor.http.HttpRequestSensorTest.tearDown() finished in 5 ms
2018-12-23 00:22:01,428 INFO  - TESTNG INVOKING CONFIGURATION: "Surefire test" - @BeforeMethod org.apache.brooklyn.core.sensor.http.HttpRequestSensorTest.setUp()
2018-12-23 00:22:01,429 INFO  - Added external config supplier named 'brooklyn-demo-sample': org.apache.brooklyn.core.config.external.InPlaceExternalConfigSupplier@3d19b51d
2018-12-23 00:22:01,464 INFO  - TESTNG PASSED CONFIGURATION: "Surefire test" - @BeforeMethod org.apache.brooklyn.core.sensor.http.HttpRequestSensorTest.setUp() finished in 36 ms
2018-12-23 00:22:01,465 INFO  - TESTNG INVOKING: "Surefire test" - org.apache.brooklyn.core.sensor.http.HttpRequestSensorTest.testNonJson()
2018-12-23 00:22:01,472 INFO  - TESTNG PASSED: "Surefire test" - org.apache.brooklyn.core.sensor.http.HttpRequestSensorTest.testNonJson() finished in 8 ms
2018-12-23 00:22:01,473 INFO  - TESTNG INVOKING CONFIGURATION: "Surefire test" - @AfterMethod org.apache.brooklyn.core.sensor.http.HttpRequestSensorTest.tearDown()
2018-12-23 00:22:01,476 INFO  - TESTNG PASSED CONFIGURATION: "Surefire test" - @AfterMethod org.apache.brooklyn.core.sensor.http.HttpRequestSensorTest.tearDown() finished in 4 ms
2018-12-23 00:22:01,477 INFO  - TESTNG INVOKING CONFIGURATION: "Surefire test" - @BeforeMethod org.apache.brooklyn.core.sensor.http.HttpRequestSensorTest.setUp()
2018-12-23 00:22:01,478 INFO  - Added external config supplier named 'brooklyn-demo-sample': org.apache.brooklyn.core.config.external.InPlaceExternalConfigSupplier@5bf278a3
2018-12-23 00:22:01,515 INFO  - TESTNG PASSED CONFIGURATION: "Surefire test" - @BeforeMethod org.apache.brooklyn.core.sensor.http.HttpRequestSensorTest.setUp() finished in 38 ms
2018-12-23 00:22:01,515 INFO  - TESTNG INVOKING: "Surefire test" - org.apache.brooklyn.core.sensor.http.HttpRequestSensorTest.testPreemptiveBasicAuth()
2018-12-23 00:22:01,523 INFO  - TESTNG PASSED: "Surefire test" - org.apache.brooklyn.core.sensor.http.HttpRequestSensorTest.testPreemptiveBasicAuth() finished in 8 ms
2018-12-23 00:22:01,524 INFO  - TESTNG INVOKING CONFIGURATION: "Surefire test" - @AfterMethod org.apache.brooklyn.core.sensor.http.HttpRequestSensorTest.tearDown()
2018-12-23 00:22:01,529 INFO  - TESTNG PASSED CONFIGURATION: "Surefire test" - @AfterMethod org.apache.brooklyn.core.sensor.http.HttpRequestSensorTest.tearDown() finished in 6 ms
2018-12-23 00:22:01,530 INFO  - TESTNG INVOKING CONFIGURATION: "Surefire test" - @BeforeMethod org.apache.brooklyn.core.test.BrooklynAppUnitTestSupport.setUp()
2018-12-23 00:22:01,530 INFO  - Added external config supplier named 'brooklyn-demo-sample': org.apache.brooklyn.core.config.external.InPlaceExternalConfigSupplier@7fa582b
2018-12-23 00:22:01,540 INFO  - TESTNG PASSED CONFIGURATION: "Surefire test" - @BeforeMethod org.apache.brooklyn.core.test.BrooklynAppUnitTestSupport.setUp() finished in 10 ms
2018-12-23 00:22:01,540 INFO  - TESTNG INVOKING: "Surefire test" - org.apache.brooklyn.core.sensor.MaxConcurrencySensorTest.testAddsStaticSensorOfTypeString()
2018-12-23 00:22:01,551 INFO  - TESTNG PASSED: "Surefire test" - org.apache.brooklyn.core.sensor.MaxConcurrencySensorTest.testAddsStaticSensorOfTypeString() finished in 10 ms
2018-12-23 00:22:01,551 INFO  - TESTNG INVOKING CONFIGURATION: "Surefire test" - @AfterMethod org.apache.brooklyn.core.test.BrooklynMgmtUnitTestSupport.tearDown()
2018-12-23 00:22:01,553 INFO  - TESTNG PASSED CONFIGURATION: "Surefire test" - @AfterMethod org.apache.brooklyn.core.test.BrooklynMgmtUnitTestSupport.tearDown() finished in 2 ms
2018-12-23 00:22:01,554 INFO  - TESTNG INVOKING CONFIGURATION: "Surefire test" - @BeforeMethod org.apache.brooklyn.core.test.BrooklynAppUnitTestSupport.setUp()
2018-12-23 00:22:01,554 INFO  - Added external config supplier named 'brooklyn-demo-sample': org.apache.brooklyn.core.config.external.InPlaceExternalConfigSupplier@15ec18e4
2018-12-23 00:22:01,563 INFO  - TESTNG PASSED CONFIGURATION: "Surefire test" - @BeforeMethod org.apache.brooklyn.core.test.BrooklynAppUnitTestSupport.setUp() finished in 9 ms
2018-12-23 00:22:01,563 INFO  - TESTNG INVOKING: "Surefire test" - org.apache.brooklyn.core.sensor.SensorEventPredicatesTest.testSensorEqualTo()
2018-12-23 00:22:01,564 INFO  - TESTNG PASSED: "Surefire test" - org.apache.brooklyn.core.sensor.SensorEventPredicatesTest.testSensorEqualTo() finished in 1 ms
2018-12-23 00:22:01,564 INFO  - TESTNG INVOKING CONFIGURATION: "Surefire test" - @AfterMethod org.apache.brooklyn.core.test.BrooklynMgmtUnitTestSupport.tearDown()
2018-12-23 00:22:01,567 INFO  - TESTNG PASSED CONFIGURATION: "Surefire test" - @AfterMethod org.apache.brooklyn.core.test.BrooklynMgmtUnitTestSupport.tearDown() finished in 3 ms
2018-12-23 00:22:01,567 INFO  - TESTNG INVOKING CONFIGURATION: "Surefire test" - @BeforeMethod org.apache.brooklyn.core.test.BrooklynAppUnitTestSupport.setUp()
2018-12-23 00:22:01,568 INFO  - Added external config supplier named 'brooklyn-demo-sample': org.apache.brooklyn.core.config.external.InPlaceExternalConfigSupplier@4c629554
2018-12-23 00:22:01,576 INFO  - TESTNG PASSED CONFIGURATION: "Surefire test" - @BeforeMethod org.apache.brooklyn.core.test.BrooklynAppUnitTestSupport.setUp() finished in 9 ms
2018-12-23 00:22:01,576 INFO  - TESTNG INVOKING: "Surefire test" - org.apache.brooklyn.core.sensor.SensorEventPredicatesTest.testSensorSatisfies()
2018-12-23 00:22:01,577 INFO  - TESTNG PASSED: "Surefire test" - org.apache.brooklyn.core.sensor.SensorEventPredicatesTest.testSensorSatisfies() finished in 1 ms
2018-12-23 00:22:01,577 INFO  - TESTNG INVOKING CONFIGURATION: "Surefire test" - @AfterMethod org.apache.brooklyn.core.test.BrooklynMgmtUnitTestSupport.tearDown()
2018-12-23 00:22:01,580 INFO  - TESTNG PASSED CONFIGURATION: "Surefire test" - @AfterMethod org.apache.brooklyn.core.test.BrooklynMgmtUnitTestSupport.tearDown() finished in 3 ms
2018-12-23 00:22:01,580 INFO  - TESTNG INVOKING CONFIGURATION: "Surefire test" - @BeforeMethod org.apache.brooklyn.core.test.BrooklynAppUnitTestSupport.setUp()
2018-12-23 00:22:01,580 INFO  - Added external config supplier named 'brooklyn-demo-sample': org.apache.brooklyn.core.config.external.InPlaceExternalConfigSupplier@c03c678
2018-12-23 00:22:01,595 INFO  - TESTNG PASSED CONFIGURATION: "Surefire test" - @BeforeMethod org.apache.brooklyn.core.test.BrooklynAppUnitTestSupport.setUp() finished in 15 ms
2018-12-23 00:22:01,595 INFO  - TESTNG INVOKING: "Surefire test" - org.apache.brooklyn.core.sensor.SensorEventPredicatesTest.testValueEqualTo()
2018-12-23 00:22:01,596 INFO  - TESTNG PASSED: "Surefire test" - org.apache.brooklyn.core.sensor.SensorEventPredicatesTest.testValueEqualTo() finished in 1 ms
2018-12-23 00:22:01,596 INFO  - TESTNG INVOKING CONFIGURATION: "Surefire test" - @AfterMethod org.apache.brooklyn.core.test.BrooklynMgmtUnitTestSupport.tearDown()
2018-12-23 00:22:01,599 INFO  - TESTNG PASSED CONFIGURATION: "Surefire test" - @AfterMethod org.apache.brooklyn.core.test.BrooklynMgmtUnitTestSupport.tearDown() finished in 3 ms
2018-12-23 00:22:01,599 INFO  - TESTNG INVOKING CONFIGURATION: "Surefire test" - @BeforeMethod org.apache.brooklyn.core.test.BrooklynAppUnitTestSupport.setUp()
2018-12-23 00:22:01,600 INFO  - Added external config supplier named 'brooklyn-demo-sample': org.apache.brooklyn.core.config.external.InPlaceExternalConfigSupplier@dbeddb9
2018-12-23 00:22:01,609 INFO  - TESTNG PASSED CONFIGURATION: "Surefire test" - @BeforeMethod org.apache.brooklyn.core.test.BrooklynAppUnitTestSupport.setUp() finished in 10 ms
2018-12-23 00:22:01,609 INFO  - TESTNG INVOKING: "Surefire test" - org.apache.brooklyn.core.sensor.SensorEventPredicatesTest.testValueSatisfies()
2018-12-23 00:22:01,609 INFO  - TESTNG PASSED: "Surefire test" - org.apache.brooklyn.core.sensor.SensorEventPredicatesTest.testValueSatisfies() finished in 0 ms
2018-12-23 00:22:01,609 INFO  - TESTNG INVOKING CONFIGURATION: "Surefire test" - @AfterMethod org.apache.brooklyn.core.test.BrooklynMgmtUnitTestSupport.tearDown()
2018-12-23 00:22:01,612 INFO  - TESTNG PASSED CONFIGURATION: "Surefire test" - @AfterMethod org.apache.brooklyn.core.test.BrooklynMgmtUnitTestSupport.tearDown() finished in 3 ms
2018-12-23 00:22:01,865 INFO  - TESTNG 
===============================================
    Surefire test
    Tests run: 2348, Failures: 1, Skips: 0
===============================================
[GC (Allocation Failure)  397862K->180949K(763904K), 0.0382302 secs]
[GC (Allocation Failure)  398549K->175907K(765440K), 0.0189693 secs]
[GC (Allocation Failure)  396067K->175635K(765440K), 0.0105211 secs]
[GC (Allocation Failure)  395795K->176095K(765952K), 0.0096309 secs]
[GC (Allocation Failure)  396767K->175852K(765440K), 0.0066816 secs]
[GC (Allocation Failure)  396524K->176487K(766976K), 0.0304355 secs]
Tests run: 2348, Failures: 1, Errors: 0, Skipped: 0, Time elapsed: 241.583 sec <<< FAILURE! - in TestSuite
testStopsNicelyToo(org.apache.brooklyn.core.entity.lifecycle.ServiceStateLogicTest)  Time elapsed: 30.049 sec  <<< FAILURE!
java.lang.AssertionError: failed succeeds-eventually, 75 attempts, 30001ms elapsed: AssertionError: entity=TestEntityImpl{id=pniiuguz6o}; attribute=Sensor: service.state (org.apache.brooklyn.core.entity.lifecycle.Lifecycle) expected [stopped] but found [stopping]
	at org.apache.brooklyn.core.entity.lifecycle.ServiceStateLogicTest.assertAttributeEqualsEventually(ServiceStateLogicTest.java:339)
	at org.apache.brooklyn.core.entity.lifecycle.ServiceStateLogicTest.testStopsNicelyToo(ServiceStateLogicTest.java:144)
Caused by: java.lang.AssertionError: entity=TestEntityImpl{id=pniiuguz6o}; attribute=Sensor: service.state (org.apache.brooklyn.core.entity.lifecycle.Lifecycle) expected [stopped] but found [stopping]
	at org.apache.brooklyn.core.entity.lifecycle.ServiceStateLogicTest.assertAttributeEqualsEventually(ServiceStateLogicTest.java:339)
	at org.apache.brooklyn.core.entity.lifecycle.ServiceStateLogicTest.testStopsNicelyToo(ServiceStateLogicTest.java:144)

2018-12-23 00:22:05,195 INFO  - Brooklyn shutdown: stopping entities [TestEntityImpl{id=t5ljv68ps1}, TestEntityImpl{id=wwuexytzql}, BlockingEntityImpl{id=sse4qt5y80}]

Results :

Failed tests: 
  ServiceStateLogicTest.testStopsNicelyToo:144->assertAttributeEqualsEventually:339 failed succeeds-eventually, 75 attempts, 30001ms elapsed: AssertionError: entity=TestEntityImpl{id=pniiuguz6o}; attribute=Sensor: service.state (org.apache.brooklyn.core.entity.lifecycle.Lifecycle) expected [stopped] but found [stopping]

Tests run: 2348, Failures: 1, Errors: 0, Skipped: 0

[INFO] ------------------------------------------------------------------------
[INFO] Reactor Summary:
[INFO] 
[INFO] Brooklyn Server Root ............................... SUCCESS [  4.519 s]
[INFO] Brooklyn Parent Project ............................ SUCCESS [ 28.449 s]
[INFO] Brooklyn Test Support Utilities .................... SUCCESS [  9.183 s]
[INFO] Brooklyn Logback Includable Configuration .......... SUCCESS [  0.460 s]
[INFO] Brooklyn Common Utilities .......................... SUCCESS [ 29.152 s]
[INFO] Brooklyn API ....................................... SUCCESS [  3.641 s]
[INFO] CAMP Server Parent Project ......................... SUCCESS [  0.142 s]
[INFO] CAMP Base .......................................... SUCCESS [  3.716 s]
[INFO] Brooklyn Test Support .............................. SUCCESS [  2.334 s]
[INFO] Brooklyn REST Swagger Apidoc Utilities ............. SUCCESS [ 14.173 s]
[INFO] Brooklyn Logback Configuration ..................... SUCCESS [  0.182 s]
[INFO] CAMP Server ........................................ SUCCESS [ 14.389 s]
[INFO] Brooklyn Felix Runtime ............................. SUCCESS [  3.629 s]
[INFO] Brooklyn Groovy Utilities .......................... SUCCESS [  2.309 s]
[INFO] Brooklyn Core ...................................... FAILURE [04:55 min]
[INFO] Brooklyn Policies .................................. SKIPPED
[INFO] Brooklyn WinRM Software Entities ................... SKIPPED
[INFO] Brooklyn Secure JMXMP Agent ........................ SKIPPED
[INFO] Brooklyn JMX RMI Agent ............................. SKIPPED
[INFO] Brooklyn Jclouds Location Targets .................. SKIPPED
[INFO] Brooklyn Software Base ............................. SKIPPED
[INFO] Brooklyn CAMP ...................................... SKIPPED
[INFO] Brooklyn Launcher Common ........................... SKIPPED
[INFO] Brooklyn REST API .................................. SKIPPED
[INFO] Brooklyn REST Resources ............................ SKIPPED
[INFO] Brooklyn REST Server ............................... SKIPPED
[INFO] Brooklyn Launcher .................................. SKIPPED
[INFO] Brooklyn Container Location Targets ................ SKIPPED
[INFO] Brooklyn Command Line Interface .................... SKIPPED
[INFO] Brooklyn Test Framework ............................ SKIPPED
[INFO] Brooklyn OSGi init ................................. SKIPPED
[INFO] Brooklyn OSGi start ................................ SKIPPED
[INFO] Brooklyn Karaf ..................................... SKIPPED
[INFO] Jetty config fragment .............................. SKIPPED
[INFO] Apache Http Component extension .................... SKIPPED
[INFO] Brooklyn Karaf Features ............................ SKIPPED
[INFO] Brooklyn Karaf Shell Commands ...................... SKIPPED
[INFO] Brooklyn UI :: Parent .............................. SKIPPED
[INFO] Brooklyn UI :: Modularity Server (parent) .......... SKIPPED
[INFO] Brooklyn UI :: Modularity Server :: UI Module API .. SKIPPED
[INFO] Brooklyn UI :: Modularity Server :: UI Module Registry SKIPPED
[INFO] Brooklyn UI :: Modularity Server :: UI Proxy ....... SKIPPED
[INFO] Brooklyn UI :: Modularity Server :: UI Metadata Registry SKIPPED
[INFO] Brooklyn UI :: Modularity Server :: External UI Modules Registration Hooks SKIPPED
[INFO] Brooklyn UI :: Modularity Server :: Features ....... SKIPPED
[INFO] Brooklyn UI :: Modules (parent) .................... SKIPPED
[INFO] Brooklyn UI :: Modules - UI Utils .................. SKIPPED
[INFO] Brooklyn UI :: Modules - Home ...................... SKIPPED
[INFO] Brooklyn UI :: Modules - App inspector ............. SKIPPED
[INFO] Brooklyn UI :: Modules - Blueprint composer ........ SKIPPED
[INFO] Brooklyn UI :: Modules - Blueprint importer ........ SKIPPED
[INFO] Brooklyn UI :: Modules - Catalog ................... SKIPPED
[INFO] Brooklyn UI :: Modules - Location manager .......... SKIPPED
[INFO] Brooklyn UI :: Modules - REST API Docs ............. SKIPPED
[INFO] Brooklyn UI :: Modules - Groovy console ............ SKIPPED
[INFO] Brooklyn UI :: Modules - Logout .................... SKIPPED
[INFO] Brooklyn UI :: Modules - Features .................. SKIPPED
[INFO] Brooklyn UI :: Features ............................ SKIPPED
[INFO] Brooklyn Library Root .............................. SKIPPED
[INFO] Brooklyn CM Chef ................................... SKIPPED
[INFO] Brooklyn CM SaltStack .............................. SKIPPED
[INFO] Brooklyn CM Ansible ................................ SKIPPED
[INFO] Brooklyn CM Integration Root ....................... SKIPPED
[INFO] Brooklyn Network Software Entities ................. SKIPPED
[INFO] Brooklyn OSGi Software Entities .................... SKIPPED
[INFO] Brooklyn Database Software Entities ................ SKIPPED
[INFO] Brooklyn Web App Software Entities ................. SKIPPED
[INFO] Brooklyn Messaging Software Entities ............... SKIPPED
[INFO] Brooklyn NoSQL Data Store Software Entities ........ SKIPPED
[INFO] Brooklyn Monitoring Software Entities .............. SKIPPED
[INFO] Brooklyn Web App Software Entities ................. SKIPPED
[INFO] Brooklyn QA ........................................ SKIPPED
[INFO] Brooklyn Examples Aggregator Project ............... SKIPPED
[INFO] Brooklyn Examples Aggregator Project - Webapps ..... SKIPPED
[INFO] hello-world-webapp Maven Webapp .................... SKIPPED
[INFO] hello-world-sql-webapp Maven Webapp ................ SKIPPED
[INFO] Brooklyn Simple Web Cluster Example ................ SKIPPED
[INFO] Brooklyn Library Karaf integration ................. SKIPPED
[INFO] Brooklyn Library Catalog ........................... SKIPPED
[INFO] Brooklyn Library Karaf Features .................... SKIPPED
[INFO] Brooklyn Client .................................... SKIPPED
[INFO] Brooklyn Client Command Line Interface ............. SKIPPED
[INFO] Brooklyn REST java Client .......................... SKIPPED
[INFO] Brooklyn Downstream Project Parent ................. SKIPPED
[INFO] Brooklyn Dist Root ................................. SKIPPED
[INFO] Brooklyn All Things ................................ SKIPPED
[INFO] Brooklyn Distribution .............................. SKIPPED
[INFO] Brooklyn Karaf Distribution Parent ................. SKIPPED
[INFO] Brooklyn Karaf Server Configuration ................ SKIPPED
[INFO] Brooklyn Dist Karaf Features ....................... SKIPPED
[INFO] Brooklyn Karaf Distribution ........................ SKIPPED
[INFO] Brooklyn Karaf pax-exam itest ...................... SKIPPED
[INFO] Brooklyn Vagrant Getting Started Environment ....... SKIPPED
[INFO] Brooklyn Quick-Start Project Archetype ............. SKIPPED
[INFO] Brooklyn Shared Package Files ...................... SKIPPED
[INFO] Brooklyn RPM Package ............................... SKIPPED
[INFO] Brooklyn DEB Package ............................... SKIPPED
[INFO] Brooklyn Root 1.0.0-SNAPSHOT ....................... SKIPPED
[INFO] ------------------------------------------------------------------------
[INFO] BUILD FAILURE
[INFO] ------------------------------------------------------------------------
[INFO] Total time: 07:15 min
[INFO] Finished at: 2018-12-23T00:22:05Z
[INFO] ------------------------------------------------------------------------
[ERROR] Failed to execute goal org.apache.maven.plugins:maven-surefire-plugin:2.19.1:test (default-test) on project brooklyn-core: There are test failures.
[ERROR] 
[ERROR] Please refer to /usr/build/brooklyn-server/core/target/surefire-reports for the individual test results.
[ERROR] -> [Help 1]
[ERROR] 
[ERROR] To see the full stack trace of the errors, re-run Maven with the -e switch.
[ERROR] Re-run Maven using the -X switch to enable full debug logging.
[ERROR] 
[ERROR] For more information about the errors and possible solutions, please read the following articles:
[ERROR] [Help 1] http://cwiki.apache.org/confluence/display/MAVEN/MojoFailureException
[ERROR] 
[ERROR] After correcting the problems, you can resume the build with the command
[ERROR]   mvn <goals> -rf :brooklyn-core
Build step 'Execute shell' marked build as failure
Recording test results
TestNG Reports Processing: START
Looking for TestNG results report in workspace using pattern: **/testng-results.xml
Saving reports...
Processing '/x1/jenkins/jenkins-home/jobs/brooklyn-master-build-docker/builds/1190/testng/testng-results-1.xml'
Processing '/x1/jenkins/jenkins-home/jobs/brooklyn-master-build-docker/builds/1190/testng/testng-results-2.xml'
Processing '/x1/jenkins/jenkins-home/jobs/brooklyn-master-build-docker/builds/1190/testng/testng-results-3.xml'
Processing '/x1/jenkins/jenkins-home/jobs/brooklyn-master-build-docker/builds/1190/testng/testng-results-4.xml'
Processing '/x1/jenkins/jenkins-home/jobs/brooklyn-master-build-docker/builds/1190/testng/testng-results-5.xml'
Processing '/x1/jenkins/jenkins-home/jobs/brooklyn-master-build-docker/builds/1190/testng/testng-results-6.xml'
Processing '/x1/jenkins/jenkins-home/jobs/brooklyn-master-build-docker/builds/1190/testng/testng-results.xml'
0.033807% of tests failed, which exceeded threshold of 0%. Marking build as UNSTABLE
TestNG Reports Processing: FINISH