git.net

[Date Prev][Date Next][Thread Prev][Thread Next][Date Index][Thread Index]

Build failed in Jenkins: brooklyn-master-build-docker-pipeline #95


See <https://builds.apache.org/job/brooklyn-master-build-docker-pipeline/95/display/redirect>

------------------------------------------
[...truncated 51.51 MB...]
Progress (1): 2.2/2.7 kBProgress (1): 2.7 kB                        Downloaded from central: https://repo.maven.apache.org/maven2/org/slf4j/slf4j-api/1.7.5/slf4j-api-1.7.5.pom (2.7 kB at 224 kB/s)
Downloading from central: https://repo.maven.apache.org/maven2/org/slf4j/slf4j-parent/1.7.5/slf4j-parent-1.7.5.pom
Progress (1): 2.2/12 kBProgress (1): 5.0/12 kBProgress (1): 7.8/12 kBProgress (1): 11/12 kB Progress (1): 12 kB                      Downloaded from central: https://repo.maven.apache.org/maven2/org/slf4j/slf4j-parent/1.7.5/slf4j-parent-1.7.5.pom (12 kB at 908 kB/s)
Downloading from central: https://repo.maven.apache.org/maven2/org/apache/maven/maven-plugin-api/3.1.0/maven-plugin-api-3.1.0.pom
Progress (1): 2.8/3.0 kBProgress (1): 3.0 kB                        Downloaded from central: https://repo.maven.apache.org/maven2/org/apache/maven/maven-plugin-api/3.1.0/maven-plugin-api-3.1.0.pom (3.0 kB at 254 kB/s)
Downloading from central: https://repo.maven.apache.org/maven2/org/apache/maven/maven/3.1.0/maven-3.1.0.pom
Progress (1): 2.8/22 kBProgress (1): 5.5/22 kBProgress (1): 8.3/22 kBProgress (1): 11/22 kB Progress (1): 14/22 kBProgress (1): 16/22 kBProgress (1): 19/22 kBProgress (1): 22 kB                      Downloaded from central: https://repo.maven.apache.org/maven2/org/apache/maven/maven/3.1.0/maven-3.1.0.pom (22 kB at 1.5 MB/s)
Downloading from central: https://repo.maven.apache.org/maven2/org/apache/maven/maven-model/3.1.0/maven-model-3.1.0.pom
Progress (1): 2.8/3.8 kBProgress (1): 3.8 kB                        Downloaded from central: https://repo.maven.apache.org/maven2/org/apache/maven/maven-model/3.1.0/maven-model-3.1.0.pom (3.8 kB at 317 kB/s)
Downloading from central: https://repo.maven.apache.org/maven2/org/apache/maven/maven-artifact/3.1.0/maven-artifact-3.1.0.pom
Progress (1): 1.6 kB                    Downloaded from central: https://repo.maven.apache.org/maven2/org/apache/maven/maven-artifact/3.1.0/maven-artifact-3.1.0.pom (1.6 kB at 82 kB/s)
Downloading from central: https://repo.maven.apache.org/maven2/org/eclipse/sisu/org.eclipse.sisu.plexus/0.0.0.M2a/org.eclipse.sisu.plexus-0.0.0.M2a.pom
Progress (1): 2.2/5.9 kBProgress (1): 5.0/5.9 kBProgress (1): 5.9 kB                        Downloaded from central: https://repo.maven.apache.org/maven2/org/eclipse/sisu/org.eclipse.sisu.plexus/0.0.0.M2a/org.eclipse.sisu.plexus-0.0.0.M2a.pom (5.9 kB at 421 kB/s)
Downloading from central: https://repo.maven.apache.org/maven2/org/eclipse/sisu/sisu-plexus/0.0.0.M2a/sisu-plexus-0.0.0.M2a.pom
Progress (1): 2.8/7.9 kBProgress (1): 5.5/7.9 kBProgress (1): 7.9 kB                        Downloaded from central: https://repo.maven.apache.org/maven2/org/eclipse/sisu/sisu-plexus/0.0.0.M2a/sisu-plexus-0.0.0.M2a.pom (7.9 kB at 609 kB/s)
Downloading from central: https://repo.maven.apache.org/maven2/com/google/guava/guava/10.0.1/guava-10.0.1.pom
Progress (1): 2.2/5.4 kBProgress (1): 5.0/5.4 kBProgress (1): 5.4 kB                        Downloaded from central: https://repo.maven.apache.org/maven2/com/google/guava/guava/10.0.1/guava-10.0.1.pom (5.4 kB at 414 kB/s)
Downloading from central: https://repo.maven.apache.org/maven2/com/google/guava/guava-parent/10.0.1/guava-parent-10.0.1.pom
Progress (1): 2.0 kB                    Downloaded from central: https://repo.maven.apache.org/maven2/com/google/guava/guava-parent/10.0.1/guava-parent-10.0.1.pom (2.0 kB at 178 kB/s)
Downloading from central: https://repo.maven.apache.org/maven2/org/sonatype/sisu/sisu-guice/3.1.0/sisu-guice-3.1.0.pom
Progress (1): 2.8/10 kBProgress (1): 5.5/10 kBProgress (1): 8.3/10 kBProgress (1): 10 kB                       Downloaded from central: https://repo.maven.apache.org/maven2/org/sonatype/sisu/sisu-guice/3.1.0/sisu-guice-3.1.0.pom (10 kB at 846 kB/s)
Downloading from central: https://repo.maven.apache.org/maven2/org/sonatype/sisu/inject/guice-parent/3.1.0/guice-parent-3.1.0.pom
Progress (1): 2.2/11 kBProgress (1): 5.0/11 kBProgress (1): 7.8/11 kBProgress (1): 11/11 kB Progress (1): 11 kB                      Downloaded from central: https://repo.maven.apache.org/maven2/org/sonatype/sisu/inject/guice-parent/3.1.0/guice-parent-3.1.0.pom (11 kB at 840 kB/s)
Downloading from central: https://repo.maven.apache.org/maven2/org/eclipse/sisu/org.eclipse.sisu.inject/0.0.0.M2a/org.eclipse.sisu.inject-0.0.0.M2a.pom
Progress (1): 2.8/5.0 kBProgress (1): 5.0 kB                        Downloaded from central: https://repo.maven.apache.org/maven2/org/eclipse/sisu/org.eclipse.sisu.inject/0.0.0.M2a/org.eclipse.sisu.inject-0.0.0.M2a.pom (5.0 kB at 248 kB/s)
Downloading from central: https://repo.maven.apache.org/maven2/org/eclipse/sisu/sisu-inject/0.0.0.M2a/sisu-inject-0.0.0.M2a.pom
Progress (1): 2.8/7.8 kBProgress (1): 5.5/7.8 kBProgress (1): 7.8 kB                        Downloaded from central: https://repo.maven.apache.org/maven2/org/eclipse/sisu/sisu-inject/0.0.0.M2a/sisu-inject-0.0.0.M2a.pom (7.8 kB at 601 kB/s)
Downloading from central: https://repo.maven.apache.org/maven2/org/apache/maven/plugin-tools/maven-plugin-annotations/3.2/maven-plugin-annotations-3.2.pom
Progress (1): 1.6 kB                    Downloaded from central: https://repo.maven.apache.org/maven2/org/apache/maven/plugin-tools/maven-plugin-annotations/3.2/maven-plugin-annotations-3.2.pom (1.6 kB at 148 kB/s)
Downloading from central: https://repo.maven.apache.org/maven2/org/apache/maven/plugin-tools/maven-plugin-tools/3.2/maven-plugin-tools-3.2.pom
Progress (1): 2.8/17 kBProgress (1): 5.5/17 kBProgress (1): 8.3/17 kBProgress (1): 11/17 kB Progress (1): 14/17 kBProgress (1): 16/17 kBProgress (1): 17 kB                      Downloaded from central: https://repo.maven.apache.org/maven2/org/apache/maven/plugin-tools/maven-plugin-tools/3.2/maven-plugin-tools-3.2.pom (17 kB at 1.3 MB/s)
Downloading from central: https://repo.maven.apache.org/maven2/com/github/eirslett/frontend-plugin-core/1.3/frontend-plugin-core-1.3.jar
Downloading from central: https://repo.maven.apache.org/maven2/commons-io/commons-io/1.3.2/commons-io-1.3.2.jar
Downloading from central: https://repo.maven.apache.org/maven2/org/slf4j/slf4j-api/1.7.5/slf4j-api-1.7.5.jar
Downloading from central: https://repo.maven.apache.org/maven2/org/apache/httpcomponents/httpcore/4.4.3/httpcore-4.4.3.jar
Downloading from central: https://repo.maven.apache.org/maven2/org/apache/httpcomponents/httpclient/4.5.1/httpclient-4.5.1.jar
Progress (1): 2.8/70 kBProgress (1): 5.5/70 kBProgress (2): 5.5/70 kB | 2.2/26 kBProgress (2): 8.3/70 kB | 2.2/26 kBProgress (2): 8.3/70 kB | 5.0/26 kBProgress (2): 11/70 kB | 5.0/26 kB Progress (2): 11/70 kB | 7.7/26 kBProgress (2): 14/70 kB | 7.7/26 kBProgress (2): 14/70 kB | 10/26 kB Progress (2): 16/70 kB | 10/26 kBProgress (2): 16/70 kB | 13/26 kBProgress (2): 19/70 kB | 13/26 kBProgress (2): 19/70 kB | 16/26 kBProgress (2): 22/70 kB | 16/26 kBProgress (2): 22/70 kB | 19/26 kBProgress (2): 25/70 kB | 19/26 kBProgress (2): 25/70 kB | 21/26 kBProgress (3): 25/70 kB | 21/26 kB | 2.8/88 kBProgress (3): 25/70 kB | 24/26 kB | 2.8/88 kBProgress (3): 27/70 kB | 24/26 kB | 2.8/88 kBProgress (3): 27/70 kB | 24/26 kB | 5.5/88 kBProgress (3): 27/70 kB | 26 kB | 5.5/88 kB   Progress (4): 27/70 kB | 26 kB | 5.5/88 kB | 4.1/327 kBProgress (4): 27/70 kB | 26 kB | 8.3/88 kB | 4.1/327 kBProgress (4): 30/70 kB | 26 kB | 8.3/88 kB | 4.1/327 kBProgress (4): 30/70 kB | 26 kB | 11/88 kB | 4.1/327 kB Progress (4): 30/70 kB | 26 kB | 11/88 kB | 7.7/327 kBProgress (4): 30/70 kB | 26 kB | 14/88 kB | 7.7/327 kBProgress (4): 33/70 kB | 26 kB | 14/88 kB | 7.7/327 kBProgress (5): 33/70 kB | 26 kB | 14/88 kB | 7.7/327 kB | 2.2/733 kBProgress (5): 33/70 kB | 26 kB | 16/88 kB | 7.7/327 kB | 2.2/733 kBProgress (5): 33/70 kB | 26 kB | 16/88 kB | 7.7/327 kB | 5.0/733 kBProgress (5): 33/70 kB | 26 kB | 16/88 kB | 12/327 kB | 5.0/733 kB Progress (5): 33/70 kB | 26 kB | 16/88 kB | 12/327 kB | 7.7/733 kBProgress (5): 33/70 kB | 26 kB | 19/88 kB | 12/327 kB | 7.7/733 kBProgress (5): 37/70 kB | 26 kB | 19/88 kB | 12/327 kB | 7.7/733 kBProgress (5): 37/70 kB | 26 kB | 22/88 kB | 12/327 kB | 7.7/733 kBProgress (5): 37/70 kB | 26 kB | 22/88 kB | 12/327 kB | 10/733 kB Progress (5): 37/70 kB | 26 kB | 22/88 kB | 16/327 kB | 10/733 kBProgress (5): 37/70 kB | 26 kB | 22/88 kB | 16/327 kB | 13/733 kBProgress (5): 37/70 kB | 26 kB | 25/88 kB | 16/327 kB | 13/733 kBProgress (5): 41/70 kB | 26 kB | 25/88 kB | 16/327 kB | 13/733 kBProgress (5): 45/70 kB | 26 kB | 25/88 kB | 16/327 kB | 13/733 kBProgress (5): 45/70 kB | 26 kB | 25/88 kB | 20/327 kB | 13/733 kBProgress (5): 45/70 kB | 26 kB | 27/88 kB | 20/327 kB | 13/733 kBProgress (5): 45/70 kB | 26 kB | 27/88 kB | 20/327 kB | 16/733 kBProgress (5): 45/70 kB | 26 kB | 30/88 kB | 20/327 kB | 16/733 kBProgress (5): 45/70 kB | 26 kB | 30/88 kB | 24/327 kB | 16/733 kBProgress (5): 49/70 kB | 26 kB | 30/88 kB | 24/327 kB | 16/733 kBProgress (5): 49/70 kB | 26 kB | 30/88 kB | 28/327 kB | 16/733 kBProgress (5): 49/70 kB | 26 kB | 33/88 kB | 28/327 kB | 16/733 kB                                                                 Downloaded from central: https://repo.maven.apache.org/maven2/org/slf4j/slf4j-api/1.7.5/slf4j-api-1.7.5.jar (26 kB at 1.4 MB/s)
Progress (4): 49/70 kB | 37/88 kB | 28/327 kB | 16/733 kBProgress (4): 49/70 kB | 37/88 kB | 28/327 kB | 19/733 kBProgress (4): 49/70 kB | 41/88 kB | 28/327 kB | 19/733 kBProgress (4): 49/70 kB | 41/88 kB | 28/327 kB | 21/733 kB                                                         Downloading from central: https://repo.maven.apache.org/maven2/org/apache/maven/maven-plugin-api/3.1.0/maven-plugin-api-3.1.0.jar
Progress (4): 53/70 kB | 41/88 kB | 28/327 kB | 21/733 kBProgress (4): 53/70 kB | 41/88 kB | 32/327 kB | 21/733 kBProgress (4): 57/70 kB | 41/88 kB | 32/327 kB | 21/733 kBProgress (4): 57/70 kB | 41/88 kB | 32/327 kB | 24/733 kBProgress (4): 57/70 kB | 45/88 kB | 32/327 kB | 24/733 kBProgress (4): 57/70 kB | 45/88 kB | 32/327 kB | 27/733 kBProgress (4): 61/70 kB | 45/88 kB | 32/327 kB | 27/733 kBProgress (4): 61/70 kB | 45/88 kB | 32/327 kB | 30/733 kBProgress (4): 61/70 kB | 49/88 kB | 32/327 kB | 30/733 kBProgress (4): 61/70 kB | 49/88 kB | 36/327 kB | 30/733 kBProgress (4): 61/70 kB | 49/88 kB | 36/327 kB | 32/733 kBProgress (4): 66/70 kB | 49/88 kB | 36/327 kB | 32/733 kBProgress (4): 66/70 kB | 53/88 kB | 36/327 kB | 32/733 kBProgress (4): 66/70 kB | 53/88 kB | 40/327 kB | 32/733 kBProgress (4): 70/70 kB | 53/88 kB | 40/327 kB | 32/733 kBProgress (4): 70/70 kB | 57/88 kB | 40/327 kB | 32/733 kBProgress (4): 70 kB | 57/88 kB | 40/327 kB | 32/733 kB   Progress (4): 70 kB | 57/88 kB | 40/327 kB | 36/733 kBProgress (4): 70 kB | 57/88 kB | 45/327 kB | 36/733 kBProgress (4): 70 kB | 57/88 kB | 45/327 kB | 40/733 kBProgress (4): 70 kB | 61/88 kB | 45/327 kB | 40/733 kBProgress (4): 70 kB | 61/88 kB | 45/327 kB | 45/733 kBProgress (4): 70 kB | 61/88 kB | 49/327 kB | 45/733 kBProgress (4): 70 kB | 61/88 kB | 49/327 kB | 49/733 kBProgress (4): 70 kB | 65/88 kB | 49/327 kB | 49/733 kBProgress (4): 70 kB | 65/88 kB | 53/327 kB | 49/733 kBProgress (4): 70 kB | 65/88 kB | 53/327 kB | 53/733 kBProgress (4): 70 kB | 69/88 kB | 53/327 kB | 53/733 kBProgress (4): 70 kB | 69/88 kB | 57/327 kB | 53/733 kBProgress (4): 70 kB | 74/88 kB | 57/327 kB | 53/733 kBProgress (4): 70 kB | 74/88 kB | 57/327 kB | 57/733 kBProgress (4): 70 kB | 78/88 kB | 57/327 kB | 57/733 kBProgress (4): 70 kB | 78/88 kB | 61/327 kB | 57/733 kBProgress (4): 70 kB | 82/88 kB | 61/327 kB | 57/733 kBProgress (4): 70 kB | 82/88 kB | 61/327 kB | 61/733 kBProgress (4): 70 kB | 82/88 kB | 65/327 kB | 61/733 kBProgress (4): 70 kB | 86/88 kB | 65/327 kB | 61/733 kBProgress (4): 70 kB | 86/88 kB | 65/327 kB | 65/733 kBProgress (4): 70 kB | 88 kB | 65/327 kB | 65/733 kB   Progress (5): 70 kB | 88 kB | 65/327 kB | 65/733 kB | 2.2/50 kBProgress (5): 70 kB | 88 kB | 69/327 kB | 65/733 kB | 2.2/50 kBProgress (5): 70 kB | 88 kB | 69/327 kB | 69/733 kB | 2.2/50 kBProgress (5): 70 kB | 88 kB | 73/327 kB | 69/733 kB | 2.2/50 kBProgress (5): 70 kB | 88 kB | 73/327 kB | 69/733 kB | 5.0/50 kBProgress (5): 70 kB | 88 kB | 77/327 kB | 69/733 kB | 5.0/50 kBProgress (5): 70 kB | 88 kB | 77/327 kB | 73/733 kB | 5.0/50 kBProgress (5): 70 kB | 88 kB | 81/327 kB | 73/733 kB | 5.0/50 kBProgress (5): 70 kB | 88 kB | 81/327 kB | 73/733 kB | 7.7/50 kB                                                               Downloaded from central: https://repo.maven.apache.org/maven2/com/github/eirslett/frontend-plugin-core/1.3/frontend-plugin-core-1.3.jar (70 kB at 2.3 MB/s)
Progress (4): 88 kB | 81/327 kB | 77/733 kB | 7.7/50 kB                                                       Downloading from central: https://repo.maven.apache.org/maven2/org/apache/maven/maven-model/3.1.0/maven-model-3.1.0.jar
Progress (4): 88 kB | 85/327 kB | 77/733 kB | 7.7/50 kBProgress (4): 88 kB | 85/327 kB | 77/733 kB | 10/50 kB Progress (4): 88 kB | 90/327 kB | 77/733 kB | 10/50 kBProgress (4): 88 kB | 90/327 kB | 81/733 kB | 10/50 kBProgress (4): 88 kB | 94/327 kB | 81/733 kB | 10/50 kBProgress (4): 88 kB | 94/327 kB | 81/733 kB | 13/50 kBProgress (4): 88 kB | 98/327 kB | 81/733 kB | 13/50 kBProgress (4): 88 kB | 98/327 kB | 81/733 kB | 16/50 kBProgress (4): 88 kB | 98/327 kB | 85/733 kB | 16/50 kBProgress (4): 88 kB | 98/327 kB | 85/733 kB | 19/50 kBProgress (4): 88 kB | 98/327 kB | 90/733 kB | 19/50 kBProgress (4): 88 kB | 98/327 kB | 90/733 kB | 21/50 kBProgress (4): 88 kB | 102/327 kB | 90/733 kB | 21/50 kBProgress (4): 88 kB | 102/327 kB | 90/733 kB | 24/50 kBProgress (4): 88 kB | 102/327 kB | 94/733 kB | 24/50 kBProgress (4): 88 kB | 102/327 kB | 94/733 kB | 27/50 kBProgress (4): 88 kB | 106/327 kB | 94/733 kB | 27/50 kBProgress (4): 88 kB | 106/327 kB | 94/733 kB | 30/50 kBProgress (4): 88 kB | 106/327 kB | 98/733 kB | 30/50 kBProgress (4): 88 kB | 106/327 kB | 98/733 kB | 32/50 kBProgress (4): 88 kB | 110/327 kB | 98/733 kB | 32/50 kB                                                       Downloaded from central: https://repo.maven.apache.org/maven2/commons-io/commons-io/1.3.2/commons-io-1.3.2.jar (88 kB at 2.6 MB/s)
Progress (3): 110/327 kB | 98/733 kB | 36/50 kBProgress (3): 110/327 kB | 102/733 kB | 36/50 kBProgress (3): 114/327 kB | 102/733 kB | 36/50 kBProgress (3): 114/327 kB | 106/733 kB | 36/50 kBProgress (3): 114/327 kB | 106/733 kB | 40/50 kB                                                Downloading from central: https://repo.maven.apache.org/maven2/org/apache/maven/maven-artifact/3.1.0/maven-artifact-3.1.0.jar
Progress (3): 118/327 kB | 106/733 kB | 40/50 kBProgress (3): 118/327 kB | 106/733 kB | 45/50 kBProgress (3): 118/327 kB | 110/733 kB | 45/50 kBProgress (3): 118/327 kB | 110/733 kB | 49/50 kBProgress (3): 122/327 kB | 110/733 kB | 49/50 kBProgress (3): 126/327 kB | 110/733 kB | 49/50 kBProgress (3): 131/327 kB | 110/733 kB | 49/50 kBProgress (4): 131/327 kB | 110/733 kB | 49/50 kB | 2.2/164 kBProgress (4): 131/327 kB | 110/733 kB | 50 kB | 2.2/164 kB   Progress (4): 131/327 kB | 114/733 kB | 50 kB | 2.2/164 kBProgress (4): 135/327 kB | 114/733 kB | 50 kB | 2.2/164 kBProgress (4): 135/327 kB | 114/733 kB | 50 kB | 5.0/164 kBProgress (4): 139/327 kB | 114/733 kB | 50 kB | 5.0/164 kBProgress (4): 139/327 kB | 114/733 kB | 50 kB | 7.7/164 kBProgress (4): 139/327 kB | 118/733 kB | 50 kB | 7.7/164 kBProgress (4): 143/327 kB | 118/733 kB | 50 kB | 7.7/164 kBProgress (4): 143/327 kB | 122/733 kB | 50 kB | 7.7/164 kBProgress (4): 143/327 kB | 122/733 kB | 50 kB | 10/164 kB Progress (4): 143/327 kB | 126/733 kB | 50 kB | 10/164 kBProgress (4): 147/327 kB | 126/733 kB | 50 kB | 10/164 kBProgress (4): 147/327 kB | 131/733 kB | 50 kB | 10/164 kBProgress (4): 147/327 kB | 131/733 kB | 50 kB | 13/164 kBProgress (4): 147/327 kB | 131/733 kB | 50 kB | 16/164 kBProgress (4): 151/327 kB | 131/733 kB | 50 kB | 16/164 kBProgress (4): 151/327 kB | 131/733 kB | 50 kB | 19/164 kBProgress (4): 151/327 kB | 135/733 kB | 50 kB | 19/164 kBProgress (4): 151/327 kB | 135/733 kB | 50 kB | 21/164 kBProgress (4): 155/327 kB | 135/733 kB | 50 kB | 21/164 kBProgress (4): 155/327 kB | 135/733 kB | 50 kB | 24/164 kBProgress (4): 155/327 kB | 139/733 kB | 50 kB | 24/164 kBProgress (4): 155/327 kB | 139/733 kB | 50 kB | 27/164 kBProgress (4): 159/327 kB | 139/733 kB | 50 kB | 27/164 kBProgress (4): 159/327 kB | 139/733 kB | 50 kB | 30/164 kBProgress (4): 159/327 kB | 143/733 kB | 50 kB | 30/164 kBProgress (4): 159/327 kB | 143/733 kB | 50 kB | 32/164 kBProgress (4): 163/327 kB | 143/733 kB | 50 kB | 32/164 kBProgress (4): 163/327 kB | 147/733 kB | 50 kB | 32/164 kBProgress (4): 167/327 kB | 147/733 kB | 50 kB | 32/164 kBProgress (4): 167/327 kB | 147/733 kB | 50 kB | 36/164 kBProgress (4): 171/327 kB | 147/733 kB | 50 kB | 36/164 kBProgress (4): 171/327 kB | 151/733 kB | 50 kB | 36/164 kB                                                         Downloaded from central: https://repo.maven.apache.org/maven2/org/apache/maven/maven-plugin-api/3.1.0/maven-plugin-api-3.1.0.jar (50 kB at 1.1 MB/s)
Progress (3): 176/327 kB | 151/733 kB | 36/164 kBProgress (4): 176/327 kB | 151/733 kB | 36/164 kB | 4.1/52 kBProgress (4): 176/327 kB | 151/733 kB | 40/164 kB | 4.1/52 kBProgress (4): 176/327 kB | 151/733 kB | 40/164 kB | 7.7/52 kBProgress (4): 180/327 kB | 151/733 kB | 40/164 kB | 7.7/52 kB                                                             Downloading from central: https://repo.maven.apache.org/maven2/org/eclipse/sisu/org.eclipse.sisu.plexus/0.0.0.M2a/org.eclipse.sisu.plexus-0.0.0.M2a.jar
Progress (4): 180/327 kB | 155/733 kB | 40/164 kB | 7.7/52 kBProgress (4): 184/327 kB | 155/733 kB | 40/164 kB | 7.7/52 kBProgress (4): 184/327 kB | 155/733 kB | 40/164 kB | 12/52 kB Progress (4): 184/327 kB | 155/733 kB | 45/164 kB | 12/52 kBProgress (4): 184/327 kB | 155/733 kB | 45/164 kB | 16/52 kBProgress (4): 188/327 kB | 155/733 kB | 45/164 kB | 16/52 kBProgress (4): 188/327 kB | 159/733 kB | 45/164 kB | 16/52 kBProgress (4): 192/327 kB | 159/733 kB | 45/164 kB | 16/52 kBProgress (4): 192/327 kB | 159/733 kB | 49/164 kB | 16/52 kBProgress (4): 196/327 kB | 159/733 kB | 49/164 kB | 16/52 kBProgress (4): 196/327 kB | 159/733 kB | 49/164 kB | 20/52 kBProgress (4): 196/327 kB | 163/733 kB | 49/164 kB | 20/52 kBProgress (4): 196/327 kB | 163/733 kB | 49/164 kB | 24/52 kBProgress (4): 200/327 kB | 163/733 kB | 49/164 kB | 24/52 kBProgress (4): 200/327 kB | 163/733 kB | 53/164 kB | 24/52 kBProgress (4): 204/327 kB | 163/733 kB | 53/164 kB | 24/52 kBProgress (4): 204/327 kB | 163/733 kB | 53/164 kB | 28/52 kBProgress (4): 208/327 kB | 163/733 kB | 53/164 kB | 28/52 kBProgress (4): 208/327 kB | 167/733 kB | 53/164 kB | 28/52 kBProgress (4): 208/327 kB | 167/733 kB | 57/164 kB | 28/52 kBProgress (4): 208/327 kB | 171/733 kB | 57/164 kB | 28/52 kBProgress (4): 212/327 kB | 171/733 kB | 57/164 kB | 28/52 kBProgress (4): 212/327 kB | 171/733 kB | 57/164 kB | 32/52 kBProgress (4): 212/327 kB | 176/733 kB | 57/164 kB | 32/52 kBProgress (4): 212/327 kB | 176/733 kB | 61/164 kB | 32/52 kBProgress (4): 212/327 kB | 180/733 kB | 61/164 kB | 32/52 kBProgress (4): 212/327 kB | 180/733 kB | 65/164 kB | 32/52 kBProgress (4): 217/327 kB | 180/733 kB | 65/164 kB | 32/52 kBProgress (4): 217/327 kB | 180/733 kB | 65/164 kB | 36/52 kBProgress (4): 221/327 kB | 180/733 kB | 65/164 kB | 36/52 kBProgress (4): 221/327 kB | 180/733 kB | 65/164 kB | 40/52 kBProgress (4): 221/327 kB | 184/733 kB | 65/164 kB | 40/52 kBProgress (4): 221/327 kB | 184/733 kB | 65/164 kB | 45/52 kBProgress (4): 225/327 kB | 184/733 kB | 65/164 kB | 45/52 kBProgress (4): 225/327 kB | 184/733 kB | 69/164 kB | 45/52 kBProgress (4): 229/327 kB | 184/733 kB | 69/164 kB | 45/52 kBProgress (4): 229/327 kB | 184/733 kB | 69/164 kB | 49/52 kBProgress (4): 229/327 kB | 188/733 kB | 69/164 kB | 49/52 kBProgress (4): 229/327 kB | 188/733 kB | 69/164 kB | 52 kB   Progress (4): 229/327 kB | 188/733 kB | 73/164 kB | 52 kBProgress (4): 233/327 kB | 188/733 kB | 73/164 kB | 52 kBProgress (4): 233/327 kB | 192/733 kB | 73/164 kB | 52 kBProgress (4): 237/327 kB | 192/733 kB | 73/164 kB | 52 kBProgress (5): 237/327 kB | 192/733 kB | 73/164 kB | 52 kB | 4.1/202 kBProgress (5): 237/327 kB | 192/733 kB | 77/164 kB | 52 kB | 4.1/202 kBProgress (5): 237/327 kB | 192/733 kB | 77/164 kB | 52 kB | 7.7/202 kBProgress (5): 241/327 kB | 192/733 kB | 77/164 kB | 52 kB | 7.7/202 kBProgress (5): 241/327 kB | 196/733 kB | 77/164 kB | 52 kB | 7.7/202 kBProgress (5): 245/327 kB | 196/733 kB | 77/164 kB | 52 kB | 7.7/202 kBProgress (5): 245/327 kB | 196/733 kB | 77/164 kB | 52 kB | 12/202 kB Progress (5): 245/327 kB | 196/733 kB | 81/164 kB | 52 kB | 12/202 kBProgress (5): 245/327 kB | 200/733 kB | 81/164 kB | 52 kB | 12/202 kBProgress (5): 245/327 kB | 200/733 kB | 81/164 kB | 52 kB | 16/202 kBProgress (5): 245/327 kB | 204/733 kB | 81/164 kB | 52 kB | 16/202 kBProgress (5): 249/327 kB | 204/733 kB | 81/164 kB | 52 kB | 16/202 kBProgress (5): 249/327 kB | 208/733 kB | 81/164 kB | 52 kB | 16/202 kBProgress (5): 249/327 kB | 208/733 kB | 85/164 kB | 52 kB | 16/202 kBProgress (5): 249/327 kB | 212/733 kB | 85/164 kB | 52 kB | 16/202 kBProgress (5): 249/327 kB | 212/733 kB | 85/164 kB | 52 kB | 20/202 kBProgress (5): 253/327 kB | 212/733 kB | 85/164 kB | 52 kB | 20/202 kBProgress (5): 253/327 kB | 212/733 kB | 85/164 kB | 52 kB | 24/202 kBProgress (5): 253/327 kB | 212/733 kB | 90/164 kB | 52 kB | 24/202 kBProgress (5): 253/327 kB | 212/733 kB | 90/164 kB | 52 kB | 28/202 kBProgress (5): 253/327 kB | 217/733 kB | 90/164 kB | 52 kB | 28/202 kBProgress (5): 258/327 kB | 217/733 kB | 90/164 kB | 52 kB | 28/202 kBProgress (5): 258/327 kB | 221/733 kB | 90/164 kB | 52 kB | 28/202 kBProgress (5): 258/327 kB | 221/733 kB | 90/164 kB | 52 kB | 32/202 kBProgress (5): 258/327 kB | 221/733 kB | 94/164 kB | 52 kB | 32/202 kBProgress (5): 258/327 kB | 225/733 kB | 94/164 kB | 52 kB | 32/202 kBProgress (5): 262/327 kB | 225/733 kB | 94/164 kB | 52 kB | 32/202 kBProgress (5): 262/327 kB | 225/733 kB | 94/164 kB | 52 kB | 36/202 kBProgress (5): 262/327 kB | 229/733 kB | 94/164 kB | 52 kB | 36/202 kBProgress (5): 262/327 kB | 229/733 kB | 98/164 kB | 52 kB | 36/202 kB                                                                     Downloaded from central: https://repo.maven.apache.org/maven2/org/apache/maven/maven-artifact/3.1.0/maven-artifact-3.1.0.jar (52 kB at 884 kB/s)
Progress (4): 266/327 kB | 229/733 kB | 98/164 kB | 36/202 kBProgress (4): 266/327 kB | 229/733 kB | 98/164 kB | 40/202 kBProgress (4): 270/327 kB | 229/733 kB | 98/164 kB | 40/202 kB                                                             Downloading from central: https://repo.maven.apache.org/maven2/com/google/guava/guava/10.0.1/guava-10.0.1.jar
Progress (4): 270/327 kB | 229/733 kB | 102/164 kB | 40/202 kBProgress (4): 270/327 kB | 233/733 kB | 102/164 kB | 40/202 kBProgress (4): 270/327 kB | 233/733 kB | 106/164 kB | 40/202 kBProgress (4): 274/327 kB | 233/733 kB | 106/164 kB | 40/202 kBProgress (4): 274/327 kB | 233/733 kB | 106/164 kB | 45/202 kBProgress (4): 278/327 kB | 233/733 kB | 106/164 kB | 45/202 kBProgress (4): 278/327 kB | 233/733 kB | 110/164 kB | 45/202 kBProgress (4): 278/327 kB | 237/733 kB | 110/164 kB | 45/202 kBProgress (4): 278/327 kB | 237/733 kB | 114/164 kB | 45/202 kBProgress (4): 278/327 kB | 237/733 kB | 114/164 kB | 49/202 kBProgress (4): 282/327 kB | 237/733 kB | 114/164 kB | 49/202 kBProgress (4): 282/327 kB | 241/733 kB | 114/164 kB | 49/202 kBProgress (4): 286/327 kB | 241/733 kB | 114/164 kB | 49/202 kBProgress (4): 286/327 kB | 245/733 kB | 114/164 kB | 49/202 kBProgress (4): 286/327 kB | 245/733 kB | 118/164 kB | 49/202 kBProgress (4): 290/327 kB | 245/733 kB | 118/164 kB | 49/202 kBProgress (4): 290/327 kB | 245/733 kB | 118/164 kB | 53/202 kBProgress (4): 294/327 kB | 245/733 kB | 118/164 kB | 53/202 kBProgress (4): 294/327 kB | 245/733 kB | 122/164 kB | 53/202 kBProgress (4): 294/327 kB | 245/733 kB | 122/164 kB | 57/202 kBProgress (4): 294/327 kB | 249/733 kB | 122/164 kB | 57/202 kBProgress (4): 298/327 kB | 249/733 kB | 122/164 kB | 57/202 kBProgress (4): 298/327 kB | 249/733 kB | 122/164 kB | 61/202 kBProgress (4): 298/327 kB | 249/733 kB | 126/164 kB | 61/202 kBProgress (4): 298/327 kB | 249/733 kB | 126/164 kB | 65/202 kBProgress (4): 303/327 kB | 249/733 kB | 126/164 kB | 65/202 kBProgress (4): 303/327 kB | 253/733 kB | 126/164 kB | 65/202 kBProgress (4): 307/327 kB | 253/733 kB | 126/164 kB | 65/202 kBProgress (4): 307/327 kB | 253/733 kB | 131/164 kB | 65/202 kBProgress (4): 311/327 kB | 253/733 kB | 131/164 kB | 65/202 kBProgress (4): 311/327 kB | 253/733 kB | 131/164 kB | 69/202 kBProgress (4): 311/327 kB | 258/733 kB | 131/164 kB | 69/202 kBProgress (4): 311/327 kB | 258/733 kB | 131/164 kB | 73/202 kBProgress (4): 315/327 kB | 258/733 kB | 131/164 kB | 73/202 kBProgress (4): 315/327 kB | 262/733 kB | 131/164 kB | 73/202 kBProgress (4): 315/327 kB | 262/733 kB | 135/164 kB | 73/202 kBProgress (4): 319/327 kB | 262/733 kB | 135/164 kB | 73/202 kBProgress (4): 319/327 kB | 262/733 kB | 135/164 kB | 77/202 kBProgress (4): 323/327 kB | 262/733 kB | 135/164 kB | 77/202 kBProgress (4): 323/327 kB | 262/733 kB | 139/164 kB | 77/202 kBProgress (4): 327 kB | 262/733 kB | 139/164 kB | 77/202 kB    Progress (4): 327 kB | 262/733 kB | 139/164 kB | 81/202 kBProgress (4): 327 kB | 266/733 kB | 139/164 kB | 81/202 kBProgress (4): 327 kB | 266/733 kB | 143/164 kB | 81/202 kBProgress (4): 327 kB | 270/733 kB | 143/164 kB | 81/202 kBProgress (4): 327 kB | 270/733 kB | 147/164 kB | 81/202 kBProgress (4): 327 kB | 274/733 kB | 147/164 kB | 81/202 kBProgress (4): 327 kB | 274/733 kB | 147/164 kB | 85/202 kBProgress (4): 327 kB | 278/733 kB | 147/164 kB | 85/202 kBProgress (4): 327 kB | 278/733 kB | 147/164 kB | 90/202 kBProgress (4): 327 kB | 278/733 kB | 151/164 kB | 90/202 kBProgress (4): 327 kB | 278/733 kB | 151/164 kB | 94/202 kBProgress (4): 327 kB | 278/733 kB | 155/164 kB | 94/202 kBProgress (4): 327 kB | 278/733 kB | 155/164 kB | 98/202 kBProgress (4): 327 kB | 282/733 kB | 155/164 kB | 98/202 kBProgress (4): 327 kB | 282/733 kB | 159/164 kB | 98/202 kBProgress (4): 327 kB | 286/733 kB | 159/164 kB | 98/202 kBProgress (4): 327 kB | 286/733 kB | 163/164 kB | 98/202 kBProgress (4): 327 kB | 290/733 kB | 163/164 kB | 98/202 kBProgress (4): 327 kB | 290/733 kB | 163/164 kB | 102/202 kBProgress (4): 327 kB | 294/733 kB | 163/164 kB | 102/202 kBProgress (4): 327 kB | 294/733 kB | 164 kB | 102/202 kB    Progress (4): 327 kB | 294/733 kB | 164 kB | 106/202 kBProgress (4): 327 kB | 294/733 kB | 164 kB | 110/202 kBProgress (4): 327 kB | 298/733 kB | 164 kB | 110/202 kBProgress (4): 327 kB | 298/733 kB | 164 kB | 114/202 kBProgress (4): 327 kB | 303/733 kB | 164 kB | 114/202 kBProgress (4): 327 kB | 307/733 kB | 164 kB | 114/202 kBProgress (4): 327 kB | 311/733 kB | 164 kB | 114/202 kBProgress (4): 327 kB | 311/733 kB | 164 kB | 118/202 kBProgress (4): 327 kB | 311/733 kB | 164 kB | 122/202 kBProgress (4): 327 kB | 311/733 kB | 164 kB | 126/202 kBProgress (4): 327 kB | 315/733 kB | 164 kB | 126/202 kB                                                       Downloaded from central: https://repo.maven.apache.org/maven2/org/apache/httpcomponents/httpcore/4.4.3/httpcore-4.4.3.jar (327 kB at 4.4 MB/s)
Progress (3): 319/733 kB | 164 kB | 126/202 kBProgress (3): 319/733 kB | 164 kB | 131/202 kBProgress (3): 323/733 kB | 164 kB | 131/202 kB                                              Downloading from central: https://repo.maven.apache.org/maven2/org/sonatype/sisu/sisu-guice/3.1.0/sisu-guice-3.1.0-no_aop.jar
Progress (3): 323/733 kB | 164 kB | 135/202 kBProgress (3): 327/733 kB | 164 kB | 135/202 kBProgress (3): 327/733 kB | 164 kB | 139/202 kBProgress (3): 327/733 kB | 164 kB | 143/202 kBProgress (3): 327/733 kB | 164 kB | 147/202 kBProgress (3): 331/733 kB | 164 kB | 147/202 kBProgress (3): 335/733 kB | 164 kB | 147/202 kBProgress (3): 339/733 kB | 164 kB | 147/202 kBProgress (3): 339/733 kB | 164 kB | 151/202 kBProgress (3): 344/733 kB | 164 kB | 151/202 kBProgress (3): 344/733 kB | 164 kB | 155/202 kB                                              Downloaded from central: https://repo.maven.apache.org/maven2/org/apache/maven/maven-model/3.1.0/maven-model-3.1.0.jar (164 kB at 2.1 MB/s)
Progress (2): 348/733 kB | 155/202 kBProgress (2): 348/733 kB | 159/202 kBProgress (2): 352/733 kB | 159/202 kB                                     Downloading from central: https://repo.maven.apache.org/maven2/org/eclipse/sisu/org.eclipse.sisu.inject/0.0.0.M2a/org.eclipse.sisu.inject-0.0.0.M2a.jar
Progress (2): 356/733 kB | 159/202 kBProgress (2): 356/733 kB | 163/202 kBProgress (2): 360/733 kB | 163/202 kBProgress (2): 360/733 kB | 167/202 kBProgress (2): 364/733 kB | 167/202 kBProgress (2): 364/733 kB | 171/202 kBProgress (2): 368/733 kB | 171/202 kBProgress (2): 368/733 kB | 176/202 kBProgress (2): 372/733 kB | 176/202 kBProgress (2): 372/733 kB | 180/202 kBProgress (2): 376/733 kB | 180/202 kBProgress (2): 376/733 kB | 184/202 kBProgress (2): 380/733 kB | 184/202 kBProgress (2): 380/733 kB | 188/202 kBProgress (2): 384/733 kB | 188/202 kBProgress (2): 384/733 kB | 192/202 kBProgress (2): 389/733 kB | 192/202 kBProgress (2): 389/733 kB | 196/202 kBProgress (2): 393/733 kB | 196/202 kBProgress (3): 393/733 kB | 196/202 kB | 4.1/357 kBProgress (3): 393/733 kB | 200/202 kB | 4.1/357 kBProgress (3): 393/733 kB | 200/202 kB | 7.7/357 kBProgress (3): 397/733 kB | 200/202 kB | 7.7/357 kBProgress (3): 397/733 kB | 202 kB | 7.7/357 kB    Progress (3): 401/733 kB | 202 kB | 7.7/357 kBProgress (3): 401/733 kB | 202 kB | 12/357 kB Progress (3): 405/733 kB | 202 kB | 12/357 kBProgress (3): 405/733 kB | 202 kB | 16/357 kBProgress (3): 409/733 kB | 202 kB | 16/357 kBProgress (3): 409/733 kB | 202 kB | 20/357 kBProgress (3): 413/733 kB | 202 kB | 20/357 kBProgress (3): 413/733 kB | 202 kB | 24/357 kBProgress (3): 417/733 kB | 202 kB | 24/357 kBProgress (3): 417/733 kB | 202 kB | 28/357 kBProgress (3): 421/733 kB | 202 kB | 28/357 kBProgress (3): 421/733 kB | 202 kB | 32/357 kBProgress (3): 425/733 kB | 202 kB | 32/357 kBProgress (3): 425/733 kB | 202 kB | 36/357 kBProgress (3): 430/733 kB | 202 kB | 36/357 kBProgress (3): 430/733 kB | 202 kB | 40/357 kBProgress (3): 434/733 kB | 202 kB | 40/357 kBProgress (3): 434/733 kB | 202 kB | 45/357 kBProgress (3): 438/733 kB | 202 kB | 45/357 kBProgress (3): 438/733 kB | 202 kB | 49/357 kBProgress (3): 442/733 kB | 202 kB | 49/357 kBProgress (3): 442/733 kB | 202 kB | 53/357 kBProgress (3): 446/733 kB | 202 kB | 53/357 kBProgress (3): 446/733 kB | 202 kB | 57/357 kBProgress (3): 450/733 kB | 202 kB | 57/357 kBProgress (3): 450/733 kB | 202 kB | 61/357 kBProgress (3): 454/733 kB | 202 kB | 61/357 kBProgress (3): 454/733 kB | 202 kB | 65/357 kBProgress (3): 458/733 kB | 202 kB | 65/357 kB                                             Downloaded from central: https://repo.maven.apache.org/maven2/org/eclipse/sisu/org.eclipse.sisu.plexus/0.0.0.M2a/org.eclipse.sisu.plexus-0.0.0.M2a.jar (202 kB at 2.3 MB/s)
Progress (2): 462/733 kB | 65/357 kBProgress (2): 462/733 kB | 69/357 kBProgress (2): 466/733 kB | 69/357 kBProgress (3): 466/733 kB | 69/357 kB | 4.1/202 kB                                                 Downloading from central: https://repo.maven.apache.org/maven2/org/apache/maven/plugin-tools/maven-plugin-annotations/3.2/maven-plugin-annotations-3.2.jar
Progress (3): 466/733 kB | 69/357 kB | 7.7/202 kBProgress (3): 470/733 kB | 69/357 kB | 7.7/202 kBProgress (3): 470/733 kB | 73/357 kB | 7.7/202 kBProgress (3): 475/733 kB | 73/357 kB | 7.7/202 kBProgress (3): 475/733 kB | 73/357 kB | 12/202 kB Progress (3): 475/733 kB | 77/357 kB | 12/202 kBProgress (3): 475/733 kB | 77/357 kB | 16/202 kBProgress (3): 475/733 kB | 81/357 kB | 16/202 kBProgress (3): 479/733 kB | 81/357 kB | 16/202 kBProgress (3): 483/733 kB | 81/357 kB | 16/202 kBProgress (3): 487/733 kB | 81/357 kB | 16/202 kBProgress (3): 487/733 kB | 81/357 kB | 20/202 kBProgress (3): 491/733 kB | 81/357 kB | 20/202 kBProgress (3): 491/733 kB | 85/357 kB | 20/202 kBProgress (3): 491/733 kB | 85/357 kB | 24/202 kBProgress (3): 491/733 kB | 90/357 kB | 24/202 kBProgress (3): 491/733 kB | 90/357 kB | 28/202 kBProgress (3): 495/733 kB | 90/357 kB | 28/202 kBProgress (3): 495/733 kB | 94/357 kB | 28/202 kBProgress (3): 499/733 kB | 94/357 kB | 28/202 kBProgress (3): 499/733 kB | 94/357 kB | 32/202 kBProgress (3): 503/733 kB | 94/357 kB | 32/202 kBProgress (3): 503/733 kB | 98/357 kB | 32/202 kBProgress (3): 507/733 kB | 98/357 kB | 32/202 kBProgress (3): 507/733 kB | 98/357 kB | 36/202 kBProgress (3): 507/733 kB | 98/357 kB | 40/202 kBProgress (3): 507/733 kB | 102/357 kB | 40/202 kBProgress (3): 511/733 kB | 102/357 kB | 40/202 kBProgress (3): 511/733 kB | 102/357 kB | 45/202 kBProgress (3): 516/733 kB | 102/357 kB | 45/202 kBProgress (3): 516/733 kB | 106/357 kB | 45/202 kBProgress (3): 520/733 kB | 106/357 kB | 45/202 kBProgress (3): 520/733 kB | 106/357 kB | 49/202 kBProgress (4): 520/733 kB | 106/357 kB | 49/202 kB | 2.8/15 kBProgress (4): 524/733 kB | 106/357 kB | 49/202 kB | 2.8/15 kBProgress (4): 524/733 kB | 106/357 kB | 49/202 kB | 5.5/15 kBProgress (4): 524/733 kB | 110/357 kB | 49/202 kB | 5.5/15 kBProgress (4): 524/733 kB | 110/357 kB | 49/202 kB | 8.3/15 kBProgress (4): 524/733 kB | 110/357 kB | 53/202 kB | 8.3/15 kBProgress (4): 524/733 kB | 110/357 kB | 53/202 kB | 11/15 kB Progress (4): 528/733 kB | 110/357 kB | 53/202 kB | 11/15 kBProgress (4): 528/733 kB | 114/357 kB | 53/202 kB | 11/15 kBProgress (4): 532/733 kB | 114/357 kB | 53/202 kB | 11/15 kBProgress (4): 532/733 kB | 114/357 kB | 53/202 kB | 14/15 kBProgress (4): 532/733 kB | 114/357 kB | 57/202 kB | 14/15 kBProgress (4): 532/733 kB | 114/357 kB | 57/202 kB | 15 kB   Progress (4): 536/733 kB | 114/357 kB | 57/202 kB | 15 kBProgress (4): 536/733 kB | 114/357 kB | 61/202 kB | 15 kBProgress (4): 536/733 kB | 118/357 kB | 61/202 kB | 15 kBProgress (4): 536/733 kB | 118/357 kB | 65/202 kB | 15 kBProgress (4): 540/733 kB | 118/357 kB | 65/202 kB | 15 kBProgress (4): 540/733 kB | 122/357 kB | 65/202 kB | 15 kBProgress (4): 540/733 kB | 126/357 kB | 65/202 kB | 15 kBProgress (4): 540/733 kB | 126/357 kB | 69/202 kB | 15 kBProgress (4): 540/733 kB | 131/357 kB | 69/202 kB | 15 kBProgress (4): 540/733 kB | 131/357 kB | 73/202 kB | 15 kBProgress (4): 544/733 kB | 131/357 kB | 73/202 kB | 15 kBProgress (4): 544/733 kB | 131/357 kB | 77/202 kB | 15 kBProgress (4): 548/733 kB | 131/357 kB | 77/202 kB | 15 kBProgress (4): 548/733 kB | 131/357 kB | 81/202 kB | 15 kBProgress (4): 548/733 kB | 135/357 kB | 81/202 kB | 15 kBProgress (4): 552/733 kB | 135/357 kB | 81/202 kB | 15 kBProgress (4): 552/733 kB | 139/357 kB | 81/202 kB | 15 kBProgress (4): 557/733 kB | 139/357 kB | 81/202 kB | 15 kBProgress (4): 557/733 kB | 143/357 kB | 81/202 kB | 15 kBProgress (4): 557/733 kB | 143/357 kB | 85/202 kB | 15 kBProgress (4): 557/733 kB | 147/357 kB | 85/202 kB | 15 kBProgress (4): 557/733 kB | 147/357 kB | 90/202 kB | 15 kBProgress (4): 561/733 kB | 147/357 kB | 90/202 kB | 15 kBProgress (4): 561/733 kB | 147/357 kB | 94/202 kB | 15 kBProgress (4): 565/733 kB | 147/357 kB | 94/202 kB | 15 kBProgress (4): 565/733 kB | 147/357 kB | 98/202 kB | 15 kBProgress (4): 565/733 kB | 151/357 kB | 98/202 kB | 15 kBProgress (4): 569/733 kB | 151/357 kB | 98/202 kB | 15 kBProgress (4): 569/733 kB | 155/357 kB | 98/202 kB | 15 kBProgress (4): 573/733 kB | 155/357 kB | 98/202 kB | 15 kBProgress (4): 573/733 kB | 155/357 kB | 102/202 kB | 15 kBProgress (4): 573/733 kB | 159/357 kB | 102/202 kB | 15 kBProgress (4): 573/733 kB | 159/357 kB | 106/202 kB | 15 kB                                                          Downloaded from central: https://repo.maven.apache.org/maven2/org/apache/maven/plugin-tools/maven-plugin-annotations/3.2/maven-plugin-annotations-3.2.jar (15 kB at 145 kB/s)
Progress (3): 573/733 kB | 159/357 kB | 110/202 kBProgress (3): 577/733 kB | 159/357 kB | 110/202 kBProgress (3): 577/733 kB | 163/357 kB | 110/202 kBProgress (3): 581/733 kB | 163/357 kB | 110/202 kBProgress (3): 581/733 kB | 163/357 kB | 114/202 kBProgress (3): 585/733 kB | 163/357 kB | 114/202 kBProgress (3): 589/733 kB | 163/357 kB | 114/202 kBProgress (3): 589/733 kB | 167/357 kB | 114/202 kBProgress (3): 589/733 kB | 171/357 kB | 114/202 kBProgress (3): 589/733 kB | 171/357 kB | 118/202 kBProgress (3): 589/733 kB | 176/357 kB | 118/202 kBProgress (3): 593/733 kB | 176/357 kB | 118/202 kBProgress (3): 593/733 kB | 176/357 kB | 122/202 kBProgress (3): 597/733 kB | 176/357 kB | 122/202 kBProgress (3): 597/733 kB | 180/357 kB | 122/202 kBProgress (3): 602/733 kB | 180/357 kB | 122/202 kBProgress (3): 602/733 kB | 180/357 kB | 126/202 kBProgress (3): 606/733 kB | 180/357 kB | 126/202 kBProgress (3): 606/733 kB | 180/357 kB | 131/202 kBProgress (3): 606/733 kB | 184/357 kB | 131/202 kBProgress (3): 606/733 kB | 188/357 kB | 131/202 kBProgress (3): 606/733 kB | 192/357 kB | 131/202 kBProgress (3): 610/733 kB | 192/357 kB | 131/202 kBProgress (3): 610/733 kB | 196/357 kB | 131/202 kBProgress (3): 610/733 kB | 196/357 kB | 135/202 kBProgress (3): 614/733 kB | 196/357 kB | 135/202 kBProgress (3): 614/733 kB | 196/357 kB | 139/202 kBProgress (3): 618/733 kB | 196/357 kB | 139/202 kBProgress (3): 618/733 kB | 200/357 kB | 139/202 kBProgress (3): 618/733 kB | 200/357 kB | 143/202 kBProgress (3): 618/733 kB | 204/357 kB | 143/202 kBProgress (3): 622/733 kB | 204/357 kB | 143/202 kBProgress (3): 622/733 kB | 208/357 kB | 143/202 kBProgress (3): 622/733 kB | 208/357 kB | 147/202 kBProgress (3): 622/733 kB | 212/357 kB | 147/202 kBProgress (3): 626/733 kB | 212/357 kB | 147/202 kBProgress (3): 630/733 kB | 212/357 kB | 147/202 kBProgress (3): 630/733 kB | 212/357 kB | 151/202 kBProgress (3): 630/733 kB | 217/357 kB | 151/202 kBProgress (3): 634/733 kB | 217/357 kB | 151/202 kBProgress (3): 634/733 kB | 221/357 kB | 151/202 kBProgress (3): 634/733 kB | 221/357 kB | 155/202 kBProgress (3): 634/733 kB | 225/357 kB | 155/202 kBProgress (3): 638/733 kB | 225/357 kB | 155/202 kBProgress (3): 638/733 kB | 229/357 kB | 155/202 kBProgress (3): 638/733 kB | 229/357 kB | 159/202 kBProgress (3): 638/733 kB | 229/357 kB | 163/202 kBProgress (3): 643/733 kB | 229/357 kB | 163/202 kBProgress (3): 643/733 kB | 233/357 kB | 163/202 kBProgress (3): 647/733 kB | 233/357 kB | 163/202 kBProgress (3): 647/733 kB | 237/357 kB | 163/202 kBProgress (3): 651/733 kB | 237/357 kB | 163/202 kBProgress (3): 651/733 kB | 237/357 kB | 167/202 kBProgress (3): 655/733 kB | 237/357 kB | 167/202 kBProgress (3): 655/733 kB | 241/357 kB | 167/202 kBProgress (3): 655/733 kB | 241/357 kB | 171/202 kBProgress (3): 655/733 kB | 245/357 kB | 171/202 kBProgress (3): 655/733 kB | 245/357 kB | 176/202 kBProgress (3): 659/733 kB | 245/357 kB | 176/202 kBProgress (3): 659/733 kB | 245/357 kB | 180/202 kBProgress (3): 663/733 kB | 245/357 kB | 180/202 kBProgress (3): 663/733 kB | 249/357 kB | 180/202 kBProgress (3): 667/733 kB | 249/357 kB | 180/202 kBProgress (3): 667/733 kB | 253/357 kB | 180/202 kBProgress (3): 667/733 kB | 253/357 kB | 184/202 kBProgress (3): 671/733 kB | 253/357 kB | 184/202 kBProgress (3): 671/733 kB | 253/357 kB | 188/202 kBProgress (3): 671/733 kB | 258/357 kB | 188/202 kBProgress (3): 671/733 kB | 258/357 kB | 192/202 kBProgress (3): 671/733 kB | 262/357 kB | 192/202 kBProgress (3): 675/733 kB | 262/357 kB | 192/202 kBProgress (3): 675/733 kB | 262/357 kB | 196/202 kBProgress (3): 679/733 kB | 262/357 kB | 196/202 kBProgress (3): 683/733 kB | 262/357 kB | 196/202 kBProgress (3): 683/733 kB | 266/357 kB | 196/202 kBProgress (3): 683/733 kB | 266/357 kB | 200/202 kBProgress (3): 683/733 kB | 270/357 kB | 200/202 kBProgress (3): 688/733 kB | 270/357 kB | 200/202 kBProgress (3): 688/733 kB | 274/357 kB | 200/202 kBProgress (3): 688/733 kB | 274/357 kB | 202 kB    Progress (3): 688/733 kB | 278/357 kB | 202 kBProgress (3): 692/733 kB | 278/357 kB | 202 kBProgress (3): 696/733 kB | 278/357 kB | 202 kBProgress (3): 700/733 kB | 278/357 kB | 202 kBProgress (3): 700/733 kB | 282/357 kB | 202 kBProgress (4): 700/733 kB | 282/357 kB | 202 kB | 0/1.5 MBProgress (4): 704/733 kB | 282/357 kB | 202 kB | 0/1.5 MBProgress (4): 704/733 kB | 282/357 kB | 202 kB | 0/1.5 MBProgress (4): 704/733 kB | 286/357 kB | 202 kB | 0/1.5 MBProgress (4): 704/733 kB | 286/357 kB | 202 kB | 0/1.5 MBProgress (4): 708/733 kB | 286/357 kB | 202 kB | 0/1.5 MBProgress (4): 708/733 kB | 290/357 kB | 202 kB | 0/1.5 MBProgress (4): 712/733 kB | 290/357 kB | 202 kB | 0/1.5 MBProgress (4): 712/733 kB | 290/357 kB | 202 kB | 0/1.5 MBProgress (4): 716/733 kB | 290/357 kB | 202 kB | 0/1.5 MBProgress (4): 716/733 kB | 294/357 kB | 202 kB | 0/1.5 MBProgress (4): 720/733 kB | 294/357 kB | 202 kB | 0/1.5 MBProgress (4): 720/733 kB | 294/357 kB | 202 kB | 0/1.5 MBProgress (4): 720/733 kB | 294/357 kB | 202 kB | 0/1.5 MBProgress (4): 724/733 kB | 294/357 kB | 202 kB | 0/1.5 MBProgress (4): 724/733 kB | 298/357 kB | 202 kB | 0/1.5 MBProgress (4): 729/733 kB | 298/357 kB | 202 kB | 0/1.5 MBProgress (4): 729/733 kB | 298/357 kB | 202 kB | 0/1.5 MBProgress (4): 733/733 kB | 298/357 kB | 202 kB | 0/1.5 MBProgress (4): 733/733 kB | 303/357 kB | 202 kB | 0/1.5 MBProgress (4): 733 kB | 303/357 kB | 202 kB | 0/1.5 MB    Progress (4): 733 kB | 303/357 kB | 202 kB | 0/1.5 MBProgress (4): 733 kB | 307/357 kB | 202 kB | 0/1.5 MBProgress (4): 733 kB | 311/357 kB | 202 kB | 0/1.5 MBProgress (4): 733 kB | 311/357 kB | 202 kB | 0/1.5 MB                                                     Downloaded from central: https://repo.maven.apache.org/maven2/org/eclipse/sisu/org.eclipse.sisu.inject/0.0.0.M2a/org.eclipse.sisu.inject-0.0.0.M2a.jar (202 kB at 1.6 MB/s)
Progress (3): 733 kB | 315/357 kB | 0/1.5 MBProgress (3): 733 kB | 315/357 kB | 0/1.5 MBProgress (3): 733 kB | 319/357 kB | 0/1.5 MBProgress (3): 733 kB | 319/357 kB | 0/1.5 MBProgress (3): 733 kB | 323/357 kB | 0/1.5 MBProgress (3): 733 kB | 323/357 kB | 0/1.5 MBProgress (3): 733 kB | 327/357 kB | 0/1.5 MBProgress (3): 733 kB | 331/357 kB | 0/1.5 MBProgress (3): 733 kB | 331/357 kB | 0.1/1.5 MBProgress (3): 733 kB | 335/357 kB | 0.1/1.5 MBProgress (3): 733 kB | 335/357 kB | 0.1/1.5 MBProgress (3): 733 kB | 339/357 kB | 0.1/1.5 MBProgress (3): 733 kB | 339/357 kB | 0.1/1.5 MBProgress (3): 733 kB | 344/357 kB | 0.1/1.5 MBProgress (3): 733 kB | 344/357 kB | 0.1/1.5 MBProgress (3): 733 kB | 348/357 kB | 0.1/1.5 MBProgress (3): 733 kB | 352/357 kB | 0.1/1.5 MBProgress (3): 733 kB | 352/357 kB | 0.1/1.5 MBProgress (3): 733 kB | 356/357 kB | 0.1/1.5 MBProgress (3): 733 kB | 356/357 kB | 0.1/1.5 MBProgress (3): 733 kB | 357 kB | 0.1/1.5 MB                                              Downloaded from central: https://repo.maven.apache.org/maven2/org/apache/httpcomponents/httpclient/4.5.1/httpclient-4.5.1.jar (733 kB at 5.7 MB/s)
Progress (2): 357 kB | 0.1/1.5 MBProgress (2): 357 kB | 0.1/1.5 MBProgress (2): 357 kB | 0.1/1.5 MBProgress (2): 357 kB | 0.1/1.5 MBProgress (2): 357 kB | 0.1/1.5 MBProgress (2): 357 kB | 0.1/1.5 MBProgress (2): 357 kB | 0.1/1.5 MBProgress (2): 357 kB | 0.1/1.5 MBProgress (2): 357 kB | 0.1/1.5 MBProgress (2): 357 kB | 0.1/1.5 MBProgress (2): 357 kB | 0.1/1.5 MBProgress (2): 357 kB | 0.1/1.5 MBProgress (2): 357 kB | 0.1/1.5 MBProgress (2): 357 kB | 0.1/1.5 MBProgress (2): 357 kB | 0.1/1.5 MB                                 Downloaded from central: https://repo.maven.apache.org/maven2/org/sonatype/sisu/sisu-guice/3.1.0/sisu-guice-3.1.0-no_aop.jar (357 kB at 2.7 MB/s)
Progress (1): 0.1/1.5 MBProgress (1): 0.1/1.5 MBProgress (1): 0.1/1.5 MBProgress (1): 0.2/1.5 MBProgress (1): 0.2/1.5 MBProgress (1): 0.2/1.5 MBProgress (1): 0.2/1.5 MBProgress (1): 0.2/1.5 MBProgress (1): 0.2/1.5 MBProgress (1): 0.2/1.5 MBProgress (1): 0.2/1.5 MBProgress (1): 0.2/1.5 MBProgress (1): 0.2/1.5 MBProgress (1): 0.2/1.5 MBProgress (1): 0.2/1.5 MBProgress (1): 0.2/1.5 MBProgress (1): 0.2/1.5 MBProgress (1): 0.2/1.5 MBProgress (1): 0.2/1.5 MBProgress (1): 0.2/1.5 MBProgress (1): 0.2/1.5 MBProgress (1): 0.2/1.5 MBProgress (1): 0.2/1.5 MBProgress (1): 0.2/1.5 MBProgress (1): 0.2/1.5 MBProgress (1): 0.2/1.5 MBProgress (1): 0.2/1.5 MBProgress (1): 0.2/1.5 MBProgress (1): 0.3/1.5 MBProgress (1): 0.3/1.5 MBProgress (1): 0.3/1.5 MBProgress (1): 0.3/1.5 MBProgress (1): 0.3/1.5 MBProgress (1): 0.3/1.5 MBProgress (1): 0.3/1.5 MBProgress (1): 0.3/1.5 MBProgress (1): 0.3/1.5 MBProgress (1): 0.3/1.5 MBProgress (1): 0.3/1.5 MBProgress (1): 0.3/1.5 MBProgress (1): 0.3/1.5 MBProgress (1): 0.3/1.5 MBProgress (1): 0.3/1.5 MBProgress (1): 0.3/1.5 MBProgress (1): 0.3/1.5 MBProgress (1): 0.3/1.5 MBProgress (1): 0.3/1.5 MBProgress (1): 0.3/1.5 MBProgress (1): 0.3/1.5 MBProgress (1): 0.3/1.5 MBProgress (1): 0.3/1.5 MBProgress (1): 0.3/1.5 MBProgress (1): 0.4/1.5 MBProgress (1): 0.4/1.5 MBProgress (1): 0.4/1.5 MBProgress (1): 0.4/1.5 MBProgress (1): 0.4/1.5 MBProgress (1): 0.4/1.5 MBProgress (1): 0.4/1.5 MBProgress (1): 0.4/1.5 MBProgress (1): 0.4/1.5 MBProgress (1): 0.4/1.5 MBProgress (1): 0.4/1.5 MBProgress (1): 0.4/1.5 MBProgress (1): 0.4/1.5 MBProgress (1): 0.4/1.5 MBProgress (1): 0.4/1.5 MBProgress (1): 0.4/1.5 MBProgress (1): 0.4/1.5 MBProgress (1): 0.4/1.5 MBProgress (1): 0.4/1.5 MBProgress (1): 0.4/1.5 MBProgress (1): 0.4/1.5 MBProgress (1): 0.4/1.5 MBProgress (1): 0.4/1.5 MBProgress (1): 0.4/1.5 MBProgress (1): 0.5/1.5 MBProgress (1): 0.5/1.5 MBProgress (1): 0.5/1.5 MBProgress (1): 0.5/1.5 MBProgress (1): 0.5/1.5 MBProgress (1): 0.5/1.5 MBProgress (1): 0.5/1.5 MBProgress (1): 0.5/1.5 MBProgress (1): 0.5/1.5 MBProgress (1): 0.5/1.5 MBProgress (1): 0.5/1.5 MBProgress (1): 0.5/1.5 MBProgress (1): 0.5/1.5 MBProgress (1): 0.5/1.5 MBProgress (1): 0.5/1.5 MBProgress (1): 0.5/1.5 MBProgress (1): 0.5/1.5 MBProgress (1): 0.5/1.5 MBProgress (1): 0.5/1.5 MBProgress (1): 0.5/1.5 MBProgress (1): 0.5/1.5 MBProgress (1): 0.5/1.5 MBProgress (1): 0.5/1.5 MBProgress (1): 0.5/1.5 MBProgress (1): 0.5/1.5 MBProgress (1): 0.6/1.5 MBProgress (1): 0.6/1.5 MBProgress (1): 0.6/1.5 MBProgress (1): 0.6/1.5 MBProgress (1): 0.6/1.5 MBProgress (1): 0.6/1.5 MBProgress (1): 0.6/1.5 MBProgress (1): 0.6/1.5 MBProgress (1): 0.6/1.5 MBProgress (1): 0.6/1.5 MBProgress (1): 0.6/1.5 MBProgress (1): 0.6/1.5 MBProgress (1): 0.6/1.5 MBProgress (1): 0.6/1.5 MBProgress (1): 0.6/1.5 MBProgress (1): 0.6/1.5 MBProgress (1): 0.6/1.5 MBProgress (1): 0.6/1.5 MBProgress (1): 0.6/1.5 MBProgress (1): 0.6/1.5 MBProgress (1): 0.6/1.5 MBProgress (1): 0.6/1.5 MBProgress (1): 0.6/1.5 MBProgress (1): 0.6/1.5 MBProgress (1): 0.7/1.5 MBProgress (1): 0.7/1.5 MBProgress (1): 0.7/1.5 MBProgress (1): 0.7/1.5 MBProgress (1): 0.7/1.5 MBProgress (1): 0.7/1.5 MBProgress (1): 0.7/1.5 MBProgress (1): 0.7/1.5 MBProgress (1): 0.7/1.5 MBProgress (1): 0.7/1.5 MBProgress (1): 0.7/1.5 MBProgress (1): 0.7/1.5 MBProgress (1): 0.7/1.5 MBProgress (1): 0.7/1.5 MBProgress (1): 0.7/1.5 MBProgress (1): 0.7/1.5 MBProgress (1): 0.7/1.5 MBProgress (1): 0.7/1.5 MBProgress (1): 0.7/1.5 MBProgress (1): 0.7/1.5 MBProgress (1): 0.7/1.5 MBProgress (1): 0.7/1.5 MBProgress (1): 0.7/1.5 MBProgress (1): 0.7/1.5 MBProgress (1): 0.7/1.5 MBProgress (1): 0.8/1.5 MBProgress (1): 0.8/1.5 MBProgress (1): 0.8/1.5 MBProgress (1): 0.8/1.5 MBProgress (1): 0.8/1.5 MBProgress (1): 0.8/1.5 MBProgress (1): 0.8/1.5 MBProgress (1): 0.8/1.5 MBProgress (1): 0.8/1.5 MBProgress (1): 0.8/1.5 MBProgress (1): 0.8/1.5 MBProgress (1): 0.8/1.5 MBProgress (1): 0.8/1.5 MBProgress (1): 0.8/1.5 MBProgress (1): 0.8/1.5 MBProgress (1): 0.8/1.5 MBProgress (1): 0.8/1.5 MBProgress (1): 0.8/1.5 MBProgress (1): 0.8/1.5 MBProgress (1): 0.8/1.5 MBProgress (1): 0.8/1.5 MBProgress (1): 0.8/1.5 MBProgress (1): 0.8/1.5 MBProgress (1): 0.8/1.5 MBProgress (1): 0.9/1.5 MBProgress (1): 0.9/1.5 MBProgress (1): 0.9/1.5 MBProgress (1): 0.9/1.5 MBProgress (1): 0.9/1.5 MBProgress (1): 0.9/1.5 MBProgress (1): 0.9/1.5 MBProgress (1): 0.9/1.5 MBProgress (1): 0.9/1.5 MBProgress (1): 0.9/1.5 MBProgress (1): 0.9/1.5 MBProgress (1): 0.9/1.5 MBProgress (1): 0.9/1.5 MBProgress (1): 0.9/1.5 MBProgress (1): 0.9/1.5 MBProgress (1): 0.9/1.5 MBProgress (1): 0.9/1.5 MBProgress (1): 0.9/1.5 MBProgress (1): 0.9/1.5 MBProgress (1): 0.9/1.5 MBProgress (1): 0.9/1.5 MBProgress (1): 0.9/1.5 MBProgress (1): 0.9/1.5 MBProgress (1): 0.9/1.5 MBProgress (1): 0.9/1.5 MBProgress (1): 1.0/1.5 MBProgress (1): 1.0/1.5 MBProgress (1): 1.0/1.5 MBProgress (1): 1.0/1.5 MBProgress (1): 1.0/1.5 MBProgress (1): 1.0/1.5 MBProgress (1): 1.0/1.5 MBProgress (1): 1.0/1.5 MBProgress (1): 1.0/1.5 MBProgress (1): 1.0/1.5 MBProgress (1): 1.0/1.5 MBProgress (1): 1.0/1.5 MBProgress (1): 1.0/1.5 MBProgress (1): 1.0/1.5 MBProgress (1): 1.0/1.5 MBProgress (1): 1.0/1.5 MBProgress (1): 1.0/1.5 MBProgress (1): 1.0/1.5 MBProgress (1): 1.0/1.5 MBProgress (1): 1.0/1.5 MBProgress (1): 1.0/1.5 MBProgress (1): 1.0/1.5 MBProgress (1): 1.0/1.5 MBProgress (1): 1.0/1.5 MBProgress (1): 1.1/1.5 MBProgress (1): 1.1/1.5 MBProgress (1): 1.1/1.5 MBProgress (1): 1.1/1.5 MBProgress (1): 1.1/1.5 MBProgress (1): 1.1/1.5 MBProgress (1): 1.1/1.5 MBProgress (1): 1.1/1.5 MBProgress (1): 1.1/1.5 MBProgress (1): 1.1/1.5 MBProgress (1): 1.1/1.5 MBProgress (1): 1.1/1.5 MBProgress (1): 1.1/1.5 MBProgress (1): 1.1/1.5 MBProgress (1): 1.1/1.5 MBProgress (1): 1.1/1.5 MBProgress (1): 1.1/1.5 MBProgress (1): 1.1/1.5 MBProgress (1): 1.1/1.5 MBProgress (1): 1.1/1.5 MBProgress (1): 1.1/1.5 MBProgress (1): 1.1/1.5 MBProgress (1): 1.1/1.5 MBProgress (1): 1.1/1.5 MBProgress (1): 1.2/1.5 MBProgress (1): 1.2/1.5 MBProgress (1): 1.2/1.5 MBProgress (1): 1.2/1.5 MBProgress (1): 1.2/1.5 MBProgress (1): 1.2/1.5 MBProgress (1): 1.2/1.5 MBProgress (1): 1.2/1.5 MBProgress (1): 1.2/1.5 MBProgress (1): 1.2/1.5 MBProgress (1): 1.2/1.5 MBProgress (1): 1.2/1.5 MBProgress (1): 1.2/1.5 MBProgress (1): 1.2/1.5 MBProgress (1): 1.2/1.5 MBProgress (1): 1.2/1.5 MBProgress (1): 1.2/1.5 MBProgress (1): 1.2/1.5 MBProgress (1): 1.2/1.5 MBProgress (1): 1.2/1.5 MBProgress (1): 1.2/1.5 MBProgress (1): 1.2/1.5 MBProgress (1): 1.2/1.5 MBProgress (1): 1.2/1.5 MBProgress (1): 1.2/1.5 MBProgress (1): 1.3/1.5 MBProgress (1): 1.3/1.5 MBProgress (1): 1.3/1.5 MBProgress (1): 1.3/1.5 MBProgress (1): 1.3/1.5 MBProgress (1): 1.3/1.5 MBProgress (1): 1.3/1.5 MBProgress (1): 1.3/1.5 MBProgress (1): 1.3/1.5 MBProgress (1): 1.3/1.5 MBProgress (1): 1.3/1.5 MBProgress (1): 1.3/1.5 MBProgress (1): 1.3/1.5 MBProgress (1): 1.3/1.5 MBProgress (1): 1.3/1.5 MBProgress (1): 1.3/1.5 MBProgress (1): 1.3/1.5 MBProgress (1): 1.3/1.5 MBProgress (1): 1.3/1.5 MBProgress (1): 1.3/1.5 MBProgress (1): 1.3/1.5 MBProgress (1): 1.3/1.5 MBProgress (1): 1.3/1.5 MBProgress (1): 1.3/1.5 MBProgress (1): 1.4/1.5 MBProgress (1): 1.4/1.5 MBProgress (1): 1.4/1.5 MBProgress (1): 1.4/1.5 MBProgress (1): 1.4/1.5 MBProgress (1): 1.4/1.5 MBProgress (1): 1.4/1.5 MBProgress (1): 1.4/1.5 MBProgress (1): 1.4/1.5 MBProgress (1): 1.4/1.5 MBProgress (1): 1.4/1.5 MBProgress (1): 1.4/1.5 MBProgress (1): 1.4/1.5 MBProgress (1): 1.4/1.5 MBProgress (1): 1.4/1.5 MBProgress (1): 1.4/1.5 MBProgress (1): 1.4/1.5 MBProgress (1): 1.4/1.5 MBProgress (1): 1.4/1.5 MBProgress (1): 1.4/1.5 MBProgress (1): 1.4/1.5 MBProgress (1): 1.4/1.5 MBProgress (1): 1.4/1.5 MBProgress (1): 1.4/1.5 MBProgress (1): 1.4/1.5 MBProgress (1): 1.5/1.5 MBProgress (1): 1.5/1.5 MBProgress (1): 1.5/1.5 MBProgress (1): 1.5/1.5 MBProgress (1): 1.5/1.5 MBProgress (1): 1.5/1.5 MBProgress (1): 1.5/1.5 MBProgress (1): 1.5/1.5 MBProgress (1): 1.5/1.5 MBProgress (1): 1.5/1.5 MBProgress (1): 1.5/1.5 MBProgress (1): 1.5/1.5 MBProgress (1): 1.5 MB                        Downloaded from central: https://repo.maven.apache.org/maven2/com/google/guava/guava/10.0.1/guava-10.0.1.jar (1.5 MB at 6.8 MB/s)
[INFO] Node v8.4.0 is already installed.
[INFO] NPM 5.4.1 is already installed.
[INFO] 
[INFO] --- frontend-maven-plugin:1.3:npm (npm install) @ brooklyn-ui-utils ---
[INFO] Running 'npm install' in /home/jenkins/jenkins-slave/workspace/brooklyn-master-build-docker-pipeline/brooklyn-ui/ui-modules/utils
[ERROR] Unhandled rejection Error: EACCES: permission denied, mkdir '/.npm'
[ERROR] Unhandled rejection Error: EACCES: permission denied, mkdir '/.npm'
[ERROR] Unhandled rejection Error: EACCES: permission denied, mkdir '/.npm'
[ERROR] Unhandled rejection Error: EACCES: permission denied, mkdir '/.npm'
[ERROR] Unhandled rejection Error: EACCES: permission denied, mkdir '/.npm'
[ERROR] Unhandled rejection Error: EACCES: permission denied, mkdir '/.npm'
[ERROR] Unhandled rejection Error: EACCES: permission denied, mkdir '/.npm'
[ERROR] Unhandled rejection Error: EACCES: permission denied, mkdir '/.npm'
[ERROR] Unhandled rejection Error: EACCES: permission denied, mkdir '/.npm'
[ERROR] Unhandled rejection Error: EACCES: permission denied, mkdir '/.npm'
[ERROR] 
[ERROR] ┌──────────────────────────────────────────────┐
[ERROR] │           npm update check failed            │
[ERROR] │     Try running with sudo or get access      │
[ERROR] │     to the local update config store via     │
[ERROR] │ sudo chown -R $USER:$(id -gn $USER) /.config │
[ERROR] └──────────────────────────────────────────────┘
[ERROR] npm ERR! cb() never called!
[ERROR] 
[ERROR] npm ERR! This is an error with npm itself. Please report this error at:
[ERROR] npm ERR!     <https://github.com/npm/npm/issues>
[INFO] ------------------------------------------------------------------------
[INFO] Reactor Summary:
[INFO] 
[INFO] Brooklyn Server Root ............................... SUCCESS [  4.582 s]
[INFO] Brooklyn Parent Project ............................ SUCCESS [  6.206 s]
[INFO] Brooklyn Test Support Utilities .................... SUCCESS [  8.459 s]
[INFO] Brooklyn Logback Includable Configuration .......... SUCCESS [  0.410 s]
[INFO] Brooklyn Common Utilities .......................... SUCCESS [ 29.017 s]
[INFO] Brooklyn API ....................................... SUCCESS [  3.417 s]
[INFO] CAMP Server Parent Project ......................... SUCCESS [  0.135 s]
[INFO] CAMP Base .......................................... SUCCESS [  3.364 s]
[INFO] Brooklyn Test Support .............................. SUCCESS [  2.146 s]
[INFO] Brooklyn REST Swagger Apidoc Utilities ............. SUCCESS [ 13.726 s]
[INFO] Brooklyn Logback Configuration ..................... SUCCESS [  0.191 s]
[INFO] CAMP Server ........................................ SUCCESS [ 13.045 s]
[INFO] Brooklyn Felix Runtime ............................. SUCCESS [  3.238 s]
[INFO] Brooklyn Groovy Utilities .......................... SUCCESS [  1.966 s]
[INFO] Brooklyn Core ...................................... SUCCESS [04:06 min]
[INFO] Brooklyn Policies .................................. SUCCESS [ 31.890 s]
[INFO] Brooklyn WinRM Software Entities ................... SUCCESS [ 19.630 s]
[INFO] Brooklyn Secure JMXMP Agent ........................ SUCCESS [  7.810 s]
[INFO] Brooklyn JMX RMI Agent ............................. SUCCESS [  0.395 s]
[INFO] Brooklyn Jclouds Location Targets .................. SUCCESS [01:06 min]
[INFO] Brooklyn Software Base ............................. SUCCESS [01:29 min]
[INFO] Brooklyn CAMP ...................................... SUCCESS [02:40 min]
[INFO] Brooklyn Launcher Common ........................... SUCCESS [  4.165 s]
[INFO] Brooklyn REST API .................................. SUCCESS [  8.275 s]
[INFO] Brooklyn REST Resources ............................ SUCCESS [ 48.748 s]
[INFO] Brooklyn REST Server ............................... SUCCESS [ 22.529 s]
[INFO] Brooklyn Launcher .................................. SUCCESS [03:11 min]
[INFO] Brooklyn Container Location Targets ................ SUCCESS [ 11.691 s]
[INFO] Brooklyn Command Line Interface .................... SUCCESS [ 10.684 s]
[INFO] Brooklyn Test Framework ............................ SUCCESS [ 22.739 s]
[INFO] Brooklyn OSGi init ................................. SUCCESS [  5.271 s]
[INFO] Brooklyn OSGi start ................................ SUCCESS [  2.105 s]
[INFO] Brooklyn Karaf ..................................... SUCCESS [  0.022 s]
[INFO] Jetty config fragment .............................. SUCCESS [  1.701 s]
[INFO] Apache Http Component extension .................... SUCCESS [  0.246 s]
[INFO] Brooklyn Karaf Features ............................ SUCCESS [  0.795 s]
[INFO] Brooklyn Karaf Shell Commands ...................... SUCCESS [  8.754 s]
[INFO] Brooklyn UI :: Parent .............................. SUCCESS [  2.351 s]
[INFO] Brooklyn UI :: Modularity Server (parent) .......... SUCCESS [  0.102 s]
[INFO] Brooklyn UI :: Modularity Server :: UI Module API .. SUCCESS [  3.678 s]
[INFO] Brooklyn UI :: Modularity Server :: UI Module Registry SUCCESS [  2.086 s]
[INFO] Brooklyn UI :: Modularity Server :: UI Proxy ....... SUCCESS [  3.935 s]
[INFO] Brooklyn UI :: Modularity Server :: UI Metadata Registry SUCCESS [  0.556 s]
[INFO] Brooklyn UI :: Modularity Server :: External UI Modules Registration Hooks SUCCESS [  4.729 s]
[INFO] Brooklyn UI :: Modularity Server :: Features ....... SUCCESS [ 50.073 s]
[INFO] Brooklyn UI :: Modules (parent) .................... SUCCESS [  0.136 s]
[INFO] Brooklyn UI :: Modules - UI Utils .................. FAILURE [  2.740 s]
[INFO] Brooklyn UI :: Modules - Home ...................... SKIPPED
[INFO] Brooklyn UI :: Modules - App inspector ............. SKIPPED
[INFO] Brooklyn UI :: Modules - Blueprint composer ........ SKIPPED
[INFO] Brooklyn UI :: Modules - Blueprint importer ........ SKIPPED
[INFO] Brooklyn UI :: Modules - Catalog ................... SKIPPED
[INFO] Brooklyn UI :: Modules - Location manager .......... SKIPPED
[INFO] Brooklyn UI :: Modules - REST API Docs ............. SKIPPED
[INFO] Brooklyn UI :: Modules - Groovy console ............ SKIPPED
[INFO] Brooklyn UI :: Modules - Logout .................... SKIPPED
[INFO] Brooklyn UI :: Modules - Features .................. SKIPPED
[INFO] Brooklyn UI :: Features ............................ SKIPPED
[INFO] Brooklyn Library Root .............................. SKIPPED
[INFO] Brooklyn CM Chef ................................... SKIPPED
[INFO] Brooklyn CM SaltStack .............................. SKIPPED
[INFO] Brooklyn CM Ansible ................................ SKIPPED
[INFO] Brooklyn CM Integration Root ....................... SKIPPED
[INFO] Brooklyn Network Software Entities ................. SKIPPED
[INFO] Brooklyn OSGi Software Entities .................... SKIPPED
[INFO] Brooklyn Database Software Entities ................ SKIPPED
[INFO] Brooklyn Web App Software Entities ................. SKIPPED
[INFO] Brooklyn Messaging Software Entities ............... SKIPPED
[INFO] Brooklyn NoSQL Data Store Software Entities ........ SKIPPED
[INFO] Brooklyn Monitoring Software Entities .............. SKIPPED
[INFO] Brooklyn Web App Software Entities ................. SKIPPED
[INFO] Brooklyn QA ........................................ SKIPPED
[INFO] Brooklyn Examples Aggregator Project ............... SKIPPED
[INFO] Brooklyn Examples Aggregator Project - Webapps ..... SKIPPED
[INFO] hello-world-webapp Maven Webapp .................... SKIPPED
[INFO] hello-world-sql-webapp Maven Webapp ................ SKIPPED
[INFO] Brooklyn Simple Web Cluster Example ................ SKIPPED
[INFO] Brooklyn Library Karaf integration ................. SKIPPED
[INFO] Brooklyn Library Catalog ........................... SKIPPED
[INFO] Brooklyn Library Karaf Features .................... SKIPPED
[INFO] Brooklyn Client .................................... SKIPPED
[INFO] Brooklyn Client Command Line Interface ............. SKIPPED
[INFO] Brooklyn REST java Client .......................... SKIPPED
[INFO] Brooklyn Downstream Project Parent ................. SKIPPED
[INFO] Brooklyn Dist Root ................................. SKIPPED
[INFO] Brooklyn All Things ................................ SKIPPED
[INFO] Brooklyn Distribution .............................. SKIPPED
[INFO] Brooklyn Karaf Distribution Parent ................. SKIPPED
[INFO] Brooklyn Karaf Server Configuration ................ SKIPPED
[INFO] Brooklyn Dist Karaf Features ....................... SKIPPED
[INFO] Brooklyn Karaf Distribution ........................ SKIPPED
[INFO] Brooklyn Karaf pax-exam itest ...................... SKIPPED
[INFO] Brooklyn Vagrant Getting Started Environment ....... SKIPPED
[INFO] Brooklyn Quick-Start Project Archetype ............. SKIPPED
[INFO] Brooklyn Shared Package Files ...................... SKIPPED
[INFO] Brooklyn RPM Package ............................... SKIPPED
[INFO] Brooklyn DEB Package ............................... SKIPPED
[INFO] Brooklyn Root 1.0.0-SNAPSHOT ....................... SKIPPED
[INFO] ------------------------------------------------------------------------
[INFO] BUILD FAILURE
[INFO] ------------------------------------------------------------------------
[INFO] Total time: 19:06 min
[INFO] Finished at: 2018-12-22T02:35:52Z
[INFO] ------------------------------------------------------------------------
[ERROR] Failed to execute goal com.github.eirslett:frontend-maven-plugin:1.3:npm (npm install) on project brooklyn-ui-utils: Failed to run task: 'npm install' failed. (error code 1) -> [Help 1]
[ERROR] 
[ERROR] To see the full stack trace of the errors, re-run Maven with the -e switch.
[ERROR] Re-run Maven using the -X switch to enable full debug logging.
[ERROR] 
[ERROR] For more information about the errors and possible solutions, please read the following articles:
[ERROR] [Help 1] http://cwiki.apache.org/confluence/display/MAVEN/MojoFailureException
[ERROR] 
[ERROR] After correcting the problems, you can resume the build with the command
[ERROR]   mvn <goals> -rf :brooklyn-ui-utils
[Pipeline] }
$ docker stop --time=1 e93868f5ef3b6707b2e0ccf587ced124526d3d6f92b2ba4b9339d27a3ca0ea0e
$ docker rm -f e93868f5ef3b6707b2e0ccf587ced124526d3d6f92b2ba4b9339d27a3ca0ea0e
[Pipeline] // withDockerContainer
[Pipeline] }
[Pipeline] // stage
[Pipeline] }
[Pipeline] // withEnv
[Pipeline] }
ERROR: script returned exit code 1
[Pipeline] // catchError
[Pipeline] stage
[Pipeline] { (Publish test results)
[Pipeline] junit
Recording test results
[Pipeline] step
TestNG Reports Processing: START
Looking for TestNG results report in workspace using pattern: **/testng-results.xml
Saving reports...
Processing '/x1/jenkins/jenkins-home/jobs/brooklyn-master-build-docker-pipeline/builds/95/testng/testng-results-1.xml'
Processing '/x1/jenkins/jenkins-home/jobs/brooklyn-master-build-docker-pipeline/builds/95/testng/testng-results-10.xml'
Processing '/x1/jenkins/jenkins-home/jobs/brooklyn-master-build-docker-pipeline/builds/95/testng/testng-results-11.xml'
Processing '/x1/jenkins/jenkins-home/jobs/brooklyn-master-build-docker-pipeline/builds/95/testng/testng-results-12.xml'
Processing '/x1/jenkins/jenkins-home/jobs/brooklyn-master-build-docker-pipeline/builds/95/testng/testng-results-13.xml'
Processing '/x1/jenkins/jenkins-home/jobs/brooklyn-master-build-docker-pipeline/builds/95/testng/testng-results-14.xml'
Processing '/x1/jenkins/jenkins-home/jobs/brooklyn-master-build-docker-pipeline/builds/95/testng/testng-results-15.xml'
Processing '/x1/jenkins/jenkins-home/jobs/brooklyn-master-build-docker-pipeline/builds/95/testng/testng-results-16.xml'
Processing '/x1/jenkins/jenkins-home/jobs/brooklyn-master-build-docker-pipeline/builds/95/testng/testng-results-17.xml'
Processing '/x1/jenkins/jenkins-home/jobs/brooklyn-master-build-docker-pipeline/builds/95/testng/testng-results-18.xml'
Processing '/x1/jenkins/jenkins-home/jobs/brooklyn-master-build-docker-pipeline/builds/95/testng/testng-results-19.xml'
Processing '/x1/jenkins/jenkins-home/jobs/brooklyn-master-build-docker-pipeline/builds/95/testng/testng-results-2.xml'
Processing '/x1/jenkins/jenkins-home/jobs/brooklyn-master-build-docker-pipeline/builds/95/testng/testng-results-20.xml'
Processing '/x1/jenkins/jenkins-home/jobs/brooklyn-master-build-docker-pipeline/builds/95/testng/testng-results-21.xml'
Processing '/x1/jenkins/jenkins-home/jobs/brooklyn-master-build-docker-pipeline/builds/95/testng/testng-results-22.xml'
Processing '/x1/jenkins/jenkins-home/jobs/brooklyn-master-build-docker-pipeline/builds/95/testng/testng-results-23.xml'
Processing '/x1/jenkins/jenkins-home/jobs/brooklyn-master-build-docker-pipeline/builds/95/testng/testng-results-3.xml'
Processing '/x1/jenkins/jenkins-home/jobs/brooklyn-master-build-docker-pipeline/builds/95/testng/testng-results-4.xml'
Processing '/x1/jenkins/jenkins-home/jobs/brooklyn-master-build-docker-pipeline/builds/95/testng/testng-results-5.xml'
Processing '/x1/jenkins/jenkins-home/jobs/brooklyn-master-build-docker-pipeline/builds/95/testng/testng-results-6.xml'
Processing '/x1/jenkins/jenkins-home/jobs/brooklyn-master-build-docker-pipeline/builds/95/testng/testng-results-7.xml'
Processing '/x1/jenkins/jenkins-home/jobs/brooklyn-master-build-docker-pipeline/builds/95/testng/testng-results-8.xml'
Processing '/x1/jenkins/jenkins-home/jobs/brooklyn-master-build-docker-pipeline/builds/95/testng/testng-results-9.xml'
Processing '/x1/jenkins/jenkins-home/jobs/brooklyn-master-build-docker-pipeline/builds/95/testng/testng-results.xml'
TestNG Reports Processing: FINISH
[Pipeline] }
[Pipeline] // stage
[Pipeline] stage
[Pipeline] { (Send notifications)
[Pipeline] step