git.net

[Date Prev][Date Next][Thread Prev][Thread Next][Date Index][Thread Index]

Build failed in Jenkins: brooklyn-master-build-docker #1188


See <https://builds.apache.org/job/brooklyn-master-build-docker/1188/display/redirect>

------------------------------------------
[...truncated 7.92 MB...]
2018-12-22 02:28:33,078 INFO  - TESTNG INVOKING: "Surefire test" - org.apache.brooklyn.feed.jmx.JmxHelperTest.testSetAttribute()
2018-12-22 02:28:33,081 INFO  - TESTNG PASSED: "Surefire test" - org.apache.brooklyn.feed.jmx.JmxHelperTest.testSetAttribute() finished in 3 ms
2018-12-22 02:28:33,081 INFO  - TESTNG INVOKING CONFIGURATION: "Surefire test" - @AfterMethod org.apache.brooklyn.feed.jmx.JmxHelperTest.tearDown()
2018-12-22 02:28:33,082 INFO  - JMX tester service stopped (127.0.0.1:11095)
2018-12-22 02:28:33,082 INFO  - TESTNG PASSED CONFIGURATION: "Surefire test" - @AfterMethod org.apache.brooklyn.feed.jmx.JmxHelperTest.tearDown() finished in 1 ms
2018-12-22 02:28:33,083 INFO  - TESTNG INVOKING CONFIGURATION: "Surefire test" - @BeforeMethod org.apache.brooklyn.feed.jmx.JmxHelperTest.setUp()
2018-12-22 02:28:33,086 INFO  - JMX tester service started at URL service:jmx:rmi:///jndi/rmi://127.0.0.1:11431/jmxrmi
2018-12-22 02:28:33,089 INFO  - TESTNG PASSED CONFIGURATION: "Surefire test" - @BeforeMethod org.apache.brooklyn.feed.jmx.JmxHelperTest.setUp() finished in 6 ms
2018-12-22 02:28:33,089 INFO  - TESTNG INVOKING: "Surefire test" - org.apache.brooklyn.feed.jmx.JmxHelperTest.testSetAttributeUsingObjectNameWildcard()
2018-12-22 02:28:33,091 INFO  - TESTNG PASSED: "Surefire test" - org.apache.brooklyn.feed.jmx.JmxHelperTest.testSetAttributeUsingObjectNameWildcard() finished in 2 ms
2018-12-22 02:28:33,091 INFO  - TESTNG INVOKING CONFIGURATION: "Surefire test" - @AfterMethod org.apache.brooklyn.feed.jmx.JmxHelperTest.tearDown()
2018-12-22 02:28:33,092 INFO  - JMX tester service stopped (127.0.0.1:11431)
2018-12-22 02:28:33,092 INFO  - TESTNG PASSED CONFIGURATION: "Surefire test" - @AfterMethod org.apache.brooklyn.feed.jmx.JmxHelperTest.tearDown() finished in 1 ms
2018-12-22 02:28:33,092 INFO  - TESTNG INVOKING CONFIGURATION: "Surefire test" - @BeforeMethod org.apache.brooklyn.feed.jmx.JmxHelperTest.setUp()
2018-12-22 02:28:33,096 INFO  - JMX tester service started at URL service:jmx:rmi:///jndi/rmi://127.0.0.1:11146/jmxrmi
2018-12-22 02:28:33,100 INFO  - TESTNG PASSED CONFIGURATION: "Surefire test" - @BeforeMethod org.apache.brooklyn.feed.jmx.JmxHelperTest.setUp() finished in 8 ms
2018-12-22 02:28:33,100 INFO  - TESTNG INVOKING: "Surefire test" - org.apache.brooklyn.feed.jmx.JmxHelperTest.testSubscribeToJmxNotificationsDirectlyWithJmxHelper()
2018-12-22 02:28:33,111 INFO  - TESTNG PASSED: "Surefire test" - org.apache.brooklyn.feed.jmx.JmxHelperTest.testSubscribeToJmxNotificationsDirectlyWithJmxHelper() finished in 10 ms
2018-12-22 02:28:33,111 INFO  - TESTNG INVOKING CONFIGURATION: "Surefire test" - @AfterMethod org.apache.brooklyn.feed.jmx.JmxHelperTest.tearDown()
2018-12-22 02:28:33,113 INFO  - JMX tester service stopped (127.0.0.1:11146)
2018-12-22 02:28:33,113 INFO  - TESTNG PASSED CONFIGURATION: "Surefire test" - @AfterMethod org.apache.brooklyn.feed.jmx.JmxHelperTest.tearDown() finished in 2 ms
2018-12-22 02:28:33,114 INFO  - TESTNG INVOKING: "Surefire test" - org.apache.brooklyn.feed.jmx.JmxValueFunctionsTest.testCompositeDataToMap()
2018-12-22 02:28:33,115 INFO  - TESTNG PASSED: "Surefire test" - org.apache.brooklyn.feed.jmx.JmxValueFunctionsTest.testCompositeDataToMap() finished in 1 ms
2018-12-22 02:28:33,116 INFO  - TESTNG INVOKING: "Surefire test" - org.apache.brooklyn.feed.jmx.JmxValueFunctionsTest.testTabularDataToMap()
2018-12-22 02:28:33,116 WARN  - tablularDataToMap has overwritten key key1
2018-12-22 02:28:33,116 WARN  - tablularDataToMap has overwritten key key2
2018-12-22 02:28:33,116 WARN  - tablularDataToMap has overwritten key key1
2018-12-22 02:28:33,116 WARN  - tablularDataToMap has overwritten key key2
2018-12-22 02:28:33,116 INFO  - TESTNG PASSED: "Surefire test" - org.apache.brooklyn.feed.jmx.JmxValueFunctionsTest.testTabularDataToMap() finished in 1 ms
2018-12-22 02:28:33,116 INFO  - TESTNG INVOKING: "Surefire test" - org.apache.brooklyn.feed.jmx.JmxValueFunctionsTest.testTabularDataToMapOfMaps()
2018-12-22 02:28:33,118 INFO  - TESTNG PASSED: "Surefire test" - org.apache.brooklyn.feed.jmx.JmxValueFunctionsTest.testTabularDataToMapOfMaps() finished in 1 ms
2018-12-22 02:28:33,118 INFO  - TESTNG INVOKING CONFIGURATION: "Surefire test" - @BeforeMethod org.apache.brooklyn.feed.jmx.RebindJmxFeedTest.setUp()
2018-12-22 02:28:33,119 INFO  - Added external config supplier named 'brooklyn-demo-sample': org.apache.brooklyn.core.config.external.InPlaceExternalConfigSupplier@66c91224
2018-12-22 02:28:33,126 INFO  - Rebind check: no existing state; will persist new items to /tmp/RebindJmxFeedTest-UK28
2018-12-22 02:28:33,129 INFO  - No Camp-YAML parser registered for parsing catalog item DSL; skipping DSL-parsing
2018-12-22 02:28:33,143 INFO  - Test class org.apache.brooklyn.feed.jmx.RebindJmxFeedTest persisting to /tmp/RebindJmxFeedTest-UK28
2018-12-22 02:28:33,143 INFO  - TESTNG PASSED CONFIGURATION: "Surefire test" - @BeforeMethod org.apache.brooklyn.feed.jmx.RebindJmxFeedTest.setUp() finished in 25 ms
2018-12-22 02:28:33,143 INFO  - TESTNG INVOKING: "Surefire test" - org.apache.brooklyn.feed.jmx.RebindJmxFeedTest.testJmxFeedIsPersisted()
2018-12-22 02:28:33,162 INFO  VhpFnkZA-[ghaaqsgliy,d24qee1s54] Creating PortForwardManager(scope=global)
2018-12-22 02:28:33,180 INFO  - JMX tester service started at URL service:jmx:rmi:///jndi/rmi://localhost:40123/jmxrmi
2018-12-22 02:28:33,310 INFO  - Added external config supplier named 'brooklyn-demo-sample': org.apache.brooklyn.core.config.external.InPlaceExternalConfigSupplier@4b517357
2018-12-22 02:28:33,321 INFO  - Rebinding app, using mementoDir /tmp/RebindJmxFeedTest-UK28; object store null
2018-12-22 02:28:33,334 INFO  - Rebinding from /tmp/RebindJmxFeedTest-UK28 for master WZbZDdIO...
2018-12-22 02:28:33,336 INFO  - No Camp-YAML parser registered for parsing catalog item DSL; skipping DSL-parsing
2018-12-22 02:28:33,364 INFO  - Rebind complete (MASTER) in 42ms: 1 app, 2 entities, 1 location, 0 policies, 2 enrichers, 1 feed, 0 catalog items, 0 catalog bundles
2018-12-22 02:28:33,531 INFO  - Back-up of persisted state created on promotion, in /root/.brooklyn/brooklyn-persisted-state/backups/2018-12-22-0228-WZbZDdIO-promotion-PTJm
2018-12-22 02:28:33,571 INFO  - TESTNG PASSED: "Surefire test" - org.apache.brooklyn.feed.jmx.RebindJmxFeedTest.testJmxFeedIsPersisted() finished in 428 ms
2018-12-22 02:28:33,571 INFO  - TESTNG INVOKING CONFIGURATION: "Surefire test" - @AfterMethod org.apache.brooklyn.feed.jmx.RebindJmxFeedTest.tearDown()
2018-12-22 02:28:33,572 INFO  - JMX tester service stopped (localhost:40123)
2018-12-22 02:28:33,586 INFO  - TESTNG PASSED CONFIGURATION: "Surefire test" - @AfterMethod org.apache.brooklyn.feed.jmx.RebindJmxFeedTest.tearDown() finished in 15 ms
2018-12-22 02:28:33,587 INFO  - TESTNG INVOKING CONFIGURATION: "Surefire test" - @BeforeMethod org.apache.brooklyn.feed.jmx.RebindJmxFeedTest.setUp()
2018-12-22 02:28:33,588 INFO  - Added external config supplier named 'brooklyn-demo-sample': org.apache.brooklyn.core.config.external.InPlaceExternalConfigSupplier@186537ac
2018-12-22 02:28:33,594 INFO  - Rebind check: no existing state; will persist new items to /tmp/RebindJmxFeedTest-flQB
2018-12-22 02:28:33,596 INFO  - No Camp-YAML parser registered for parsing catalog item DSL; skipping DSL-parsing
2018-12-22 02:28:33,611 INFO  - Test class org.apache.brooklyn.feed.jmx.RebindJmxFeedTest persisting to /tmp/RebindJmxFeedTest-flQB
2018-12-22 02:28:33,611 INFO  - TESTNG PASSED CONFIGURATION: "Surefire test" - @BeforeMethod org.apache.brooklyn.feed.jmx.RebindJmxFeedTest.setUp() finished in 24 ms
2018-12-22 02:28:33,611 INFO  - TESTNG INVOKING: "Surefire test" - org.apache.brooklyn.feed.jmx.RebindJmxFeedTest.testJmxFeedIsPersistedWithPreCreatedJmxHelper()
2018-12-22 02:28:33,625 INFO  XdJfmzZ9-[xsrkg2z8om,kkxf07yl0m] Creating PortForwardManager(scope=global)
2018-12-22 02:28:33,632 INFO  - JMX tester service started at URL service:jmx:rmi:///jndi/rmi://localhost:40124/jmxrmi
2018-12-22 02:28:33,826 INFO  - Added external config supplier named 'brooklyn-demo-sample': org.apache.brooklyn.core.config.external.InPlaceExternalConfigSupplier@4628f386
2018-12-22 02:28:34,193 INFO  - Rebinding app, using mementoDir /tmp/RebindJmxFeedTest-flQB; object store null
2018-12-22 02:28:34,213 INFO  - Rebinding from /tmp/RebindJmxFeedTest-flQB for master D7JuKVHl...
2018-12-22 02:28:34,217 INFO  - No Camp-YAML parser registered for parsing catalog item DSL; skipping DSL-parsing
2018-12-22 02:28:34,251 INFO  - Rebind complete (MASTER) in 57ms: 1 app, 2 entities, 1 location, 0 policies, 2 enrichers, 1 feed, 0 catalog items, 0 catalog bundles
2018-12-22 02:28:34,411 INFO  - Back-up of persisted state created on promotion, in /root/.brooklyn/brooklyn-persisted-state/backups/2018-12-22-0228-D7JuKVHl-promotion-ACem
2018-12-22 02:28:34,471 INFO  - TESTNG PASSED: "Surefire test" - org.apache.brooklyn.feed.jmx.RebindJmxFeedTest.testJmxFeedIsPersistedWithPreCreatedJmxHelper() finished in 860 ms
2018-12-22 02:28:34,471 INFO  - TESTNG INVOKING CONFIGURATION: "Surefire test" - @AfterMethod org.apache.brooklyn.feed.jmx.RebindJmxFeedTest.tearDown()
2018-12-22 02:28:34,473 INFO  - JMX tester service stopped (localhost:40124)
2018-12-22 02:28:34,489 INFO  - TESTNG PASSED CONFIGURATION: "Surefire test" - @AfterMethod org.apache.brooklyn.feed.jmx.RebindJmxFeedTest.tearDown() finished in 18 ms
2018-12-22 02:28:34,574 INFO  - TESTNG 
===============================================
    Surefire test
    Tests run: 234, Failures: 1, Skips: 0
===============================================
[GC (Allocation Failure)  245961K->67627K(747520K), 0.0177323 secs]
Tests run: 234, Failures: 1, Errors: 0, Skipped: 0, Time elapsed: 82.196 sec <<< FAILURE! - in TestSuite
testAddExistingMachineFromSpec(org.apache.brooklyn.entity.machine.pool.ServerPoolTest)  Time elapsed: 0.2 sec  <<< FAILURE!
org.apache.brooklyn.core.mgmt.internal.EffectorUtils$EffectorCallPropagatedRuntimeException: Error invoking start at Application[u0kfbpzz]
	at org.apache.brooklyn.entity.machine.pool.ServerPoolTest.testAddExistingMachineFromSpec(ServerPoolTest.java:161)
Caused by: java.util.concurrent.ExecutionException: org.apache.brooklyn.util.exceptions.PropagatedRuntimeException: ProblemStartingChildrenException: org.apache.brooklyn.util.exceptions.PropagatedRuntimeException: 1 of 3 parallel child tasks failed: Error invoking start at EmptySoftwareProcessImpl{id=xeij5fgtxm}: No mutex known for 'installation lock at host'
	at org.apache.brooklyn.entity.machine.pool.ServerPoolTest.testAddExistingMachineFromSpec(ServerPoolTest.java:161)
Caused by: org.apache.brooklyn.util.exceptions.PropagatedRuntimeException: 
	at org.apache.brooklyn.entity.machine.pool.ServerPoolTest.testAddExistingMachineFromSpec(ServerPoolTest.java:161)
Caused by: java.lang.reflect.InvocationTargetException
	at org.apache.brooklyn.entity.machine.pool.ServerPoolTest.testAddExistingMachineFromSpec(ServerPoolTest.java:161)
Caused by: org.apache.brooklyn.core.entity.AbstractApplication$ProblemStartingChildrenException: org.apache.brooklyn.util.exceptions.PropagatedRuntimeException: 1 of 3 parallel child tasks failed: Error invoking start at EmptySoftwareProcessImpl{id=xeij5fgtxm}: No mutex known for 'installation lock at host'
	at org.apache.brooklyn.entity.machine.pool.ServerPoolTest.testAddExistingMachineFromSpec(ServerPoolTest.java:161)
Caused by: org.apache.brooklyn.util.exceptions.PropagatedRuntimeException: 
	at org.apache.brooklyn.entity.machine.pool.ServerPoolTest.testAddExistingMachineFromSpec(ServerPoolTest.java:161)
Caused by: java.util.concurrent.ExecutionException: org.apache.brooklyn.util.exceptions.PropagatedRuntimeException: 1 of 3 parallel child tasks failed: Error invoking start at EmptySoftwareProcessImpl{id=xeij5fgtxm}: No mutex known for 'installation lock at host'
	at org.apache.brooklyn.entity.machine.pool.ServerPoolTest.testAddExistingMachineFromSpec(ServerPoolTest.java:161)
Caused by: org.apache.brooklyn.util.exceptions.PropagatedRuntimeException: 1 of 3 parallel child tasks failed: Error invoking start at EmptySoftwareProcessImpl{id=xeij5fgtxm}: No mutex known for 'installation lock at host'
Caused by: java.util.concurrent.ExecutionException: org.apache.brooklyn.core.mgmt.internal.EffectorUtils$EffectorCallPropagatedRuntimeException: Error invoking start at EmptySoftwareProcessImpl{id=xeij5fgtxm}: No mutex known for 'installation lock at host'
Caused by: org.apache.brooklyn.core.mgmt.internal.EffectorUtils$EffectorCallPropagatedRuntimeException: Error invoking start at EmptySoftwareProcessImpl{id=xeij5fgtxm}
Caused by: org.apache.brooklyn.util.exceptions.PropagatedRuntimeException: 
Caused by: java.util.concurrent.ExecutionException: org.apache.brooklyn.util.exceptions.PropagatedRuntimeException: No mutex known for 'installation lock at host'
Caused by: org.apache.brooklyn.util.exceptions.PropagatedRuntimeException: 
Caused by: java.util.concurrent.ExecutionException: org.apache.brooklyn.util.exceptions.PropagatedRuntimeException: No mutex known for 'installation lock at host'
Caused by: org.apache.brooklyn.util.exceptions.PropagatedRuntimeException: 
Caused by: java.util.concurrent.ExecutionException: java.lang.IllegalStateException: No mutex known for 'installation lock at host'
Caused by: java.lang.IllegalStateException: No mutex known for 'installation lock at host'


Results :

Failed tests: 
  ServerPoolTest.testAddExistingMachineFromSpec:161 » EffectorCallPropagatedRuntime

Tests run: 234, Failures: 1, Errors: 0, Skipped: 0

[INFO] ------------------------------------------------------------------------
[INFO] Reactor Summary:
[INFO] 
[INFO] Brooklyn Server Root ............................... SUCCESS [  4.375 s]
[INFO] Brooklyn Parent Project ............................ SUCCESS [  5.554 s]
[INFO] Brooklyn Test Support Utilities .................... SUCCESS [  8.445 s]
[INFO] Brooklyn Logback Includable Configuration .......... SUCCESS [  0.461 s]
[INFO] Brooklyn Common Utilities .......................... SUCCESS [ 28.969 s]
[INFO] Brooklyn API ....................................... SUCCESS [  3.481 s]
[INFO] CAMP Server Parent Project ......................... SUCCESS [  0.130 s]
[INFO] CAMP Base .......................................... SUCCESS [  3.647 s]
[INFO] Brooklyn Test Support .............................. SUCCESS [  2.173 s]
[INFO] Brooklyn REST Swagger Apidoc Utilities ............. SUCCESS [ 14.168 s]
[INFO] Brooklyn Logback Configuration ..................... SUCCESS [  0.212 s]
[INFO] CAMP Server ........................................ SUCCESS [ 13.076 s]
[INFO] Brooklyn Felix Runtime ............................. SUCCESS [  3.321 s]
[INFO] Brooklyn Groovy Utilities .......................... SUCCESS [  2.084 s]
[INFO] Brooklyn Core ...................................... SUCCESS [04:15 min]
[INFO] Brooklyn Policies .................................. SUCCESS [ 32.967 s]
[INFO] Brooklyn WinRM Software Entities ................... SUCCESS [ 20.626 s]
[INFO] Brooklyn Secure JMXMP Agent ........................ SUCCESS [  7.787 s]
[INFO] Brooklyn JMX RMI Agent ............................. SUCCESS [  0.423 s]
[INFO] Brooklyn Jclouds Location Targets .................. SUCCESS [01:05 min]
[INFO] Brooklyn Software Base ............................. FAILURE [01:31 min]
[INFO] Brooklyn CAMP ...................................... SKIPPED
[INFO] Brooklyn Launcher Common ........................... SKIPPED
[INFO] Brooklyn REST API .................................. SKIPPED
[INFO] Brooklyn REST Resources ............................ SKIPPED
[INFO] Brooklyn REST Server ............................... SKIPPED
[INFO] Brooklyn Launcher .................................. SKIPPED
[INFO] Brooklyn Container Location Targets ................ SKIPPED
[INFO] Brooklyn Command Line Interface .................... SKIPPED
[INFO] Brooklyn Test Framework ............................ SKIPPED
[INFO] Brooklyn OSGi init ................................. SKIPPED
[INFO] Brooklyn OSGi start ................................ SKIPPED
[INFO] Brooklyn Karaf ..................................... SKIPPED
[INFO] Jetty config fragment .............................. SKIPPED
[INFO] Apache Http Component extension .................... SKIPPED
[INFO] Brooklyn Karaf Features ............................ SKIPPED
[INFO] Brooklyn Karaf Shell Commands ...................... SKIPPED
[INFO] Brooklyn UI :: Parent .............................. SKIPPED
[INFO] Brooklyn UI :: Modularity Server (parent) .......... SKIPPED
[INFO] Brooklyn UI :: Modularity Server :: UI Module API .. SKIPPED
[INFO] Brooklyn UI :: Modularity Server :: UI Module Registry SKIPPED
[INFO] Brooklyn UI :: Modularity Server :: UI Proxy ....... SKIPPED
[INFO] Brooklyn UI :: Modularity Server :: UI Metadata Registry SKIPPED
[INFO] Brooklyn UI :: Modularity Server :: External UI Modules Registration Hooks SKIPPED
[INFO] Brooklyn UI :: Modularity Server :: Features ....... SKIPPED
[INFO] Brooklyn UI :: Modules (parent) .................... SKIPPED
[INFO] Brooklyn UI :: Modules - UI Utils .................. SKIPPED
[INFO] Brooklyn UI :: Modules - Home ...................... SKIPPED
[INFO] Brooklyn UI :: Modules - App inspector ............. SKIPPED
[INFO] Brooklyn UI :: Modules - Blueprint composer ........ SKIPPED
[INFO] Brooklyn UI :: Modules - Blueprint importer ........ SKIPPED
[INFO] Brooklyn UI :: Modules - Catalog ................... SKIPPED
[INFO] Brooklyn UI :: Modules - Location manager .......... SKIPPED
[INFO] Brooklyn UI :: Modules - REST API Docs ............. SKIPPED
[INFO] Brooklyn UI :: Modules - Groovy console ............ SKIPPED
[INFO] Brooklyn UI :: Modules - Logout .................... SKIPPED
[INFO] Brooklyn UI :: Modules - Features .................. SKIPPED
[INFO] Brooklyn UI :: Features ............................ SKIPPED
[INFO] Brooklyn Library Root .............................. SKIPPED
[INFO] Brooklyn CM Chef ................................... SKIPPED
[INFO] Brooklyn CM SaltStack .............................. SKIPPED
[INFO] Brooklyn CM Ansible ................................ SKIPPED
[INFO] Brooklyn CM Integration Root ....................... SKIPPED
[INFO] Brooklyn Network Software Entities ................. SKIPPED
[INFO] Brooklyn OSGi Software Entities .................... SKIPPED
[INFO] Brooklyn Database Software Entities ................ SKIPPED
[INFO] Brooklyn Web App Software Entities ................. SKIPPED
[INFO] Brooklyn Messaging Software Entities ............... SKIPPED
[INFO] Brooklyn NoSQL Data Store Software Entities ........ SKIPPED
[INFO] Brooklyn Monitoring Software Entities .............. SKIPPED
[INFO] Brooklyn Web App Software Entities ................. SKIPPED
[INFO] Brooklyn QA ........................................ SKIPPED
[INFO] Brooklyn Examples Aggregator Project ............... SKIPPED
[INFO] Brooklyn Examples Aggregator Project - Webapps ..... SKIPPED
[INFO] hello-world-webapp Maven Webapp .................... SKIPPED
[INFO] hello-world-sql-webapp Maven Webapp ................ SKIPPED
[INFO] Brooklyn Simple Web Cluster Example ................ SKIPPED
[INFO] Brooklyn Library Karaf integration ................. SKIPPED
[INFO] Brooklyn Library Catalog ........................... SKIPPED
[INFO] Brooklyn Library Karaf Features .................... SKIPPED
[INFO] Brooklyn Client .................................... SKIPPED
[INFO] Brooklyn Client Command Line Interface ............. SKIPPED
[INFO] Brooklyn REST java Client .......................... SKIPPED
[INFO] Brooklyn Downstream Project Parent ................. SKIPPED
[INFO] Brooklyn Dist Root ................................. SKIPPED
[INFO] Brooklyn All Things ................................ SKIPPED
[INFO] Brooklyn Distribution .............................. SKIPPED
[INFO] Brooklyn Karaf Distribution Parent ................. SKIPPED
[INFO] Brooklyn Karaf Server Configuration ................ SKIPPED
[INFO] Brooklyn Dist Karaf Features ....................... SKIPPED
[INFO] Brooklyn Karaf Distribution ........................ SKIPPED
[INFO] Brooklyn Karaf pax-exam itest ...................... SKIPPED
[INFO] Brooklyn Vagrant Getting Started Environment ....... SKIPPED
[INFO] Brooklyn Quick-Start Project Archetype ............. SKIPPED
[INFO] Brooklyn Shared Package Files ...................... SKIPPED
[INFO] Brooklyn RPM Package ............................... SKIPPED
[INFO] Brooklyn DEB Package ............................... SKIPPED
[INFO] Brooklyn Root 1.0.0-SNAPSHOT ....................... SKIPPED
[INFO] ------------------------------------------------------------------------
[INFO] BUILD FAILURE
[INFO] ------------------------------------------------------------------------
[INFO] Total time: 09:47 min
[INFO] Finished at: 2018-12-22T02:28:35Z
[INFO] ------------------------------------------------------------------------
[ERROR] Failed to execute goal org.apache.maven.plugins:maven-surefire-plugin:2.19.1:test (default-test) on project brooklyn-software-base: There are test failures.
[ERROR] 
[ERROR] Please refer to /usr/build/brooklyn-server/software/base/target/surefire-reports for the individual test results.
[ERROR] -> [Help 1]
[ERROR] 
[ERROR] To see the full stack trace of the errors, re-run Maven with the -e switch.
[ERROR] Re-run Maven using the -X switch to enable full debug logging.
[ERROR] 
[ERROR] For more information about the errors and possible solutions, please read the following articles:
[ERROR] [Help 1] http://cwiki.apache.org/confluence/display/MAVEN/MojoFailureException
[ERROR] 
[ERROR] After correcting the problems, you can resume the build with the command
[ERROR]   mvn <goals> -rf :brooklyn-software-base
Build step 'Execute shell' marked build as failure
Recording test results
TestNG Reports Processing: START
Looking for TestNG results report in workspace using pattern: **/testng-results.xml
Saving reports...
Processing '/x1/jenkins/jenkins-home/jobs/brooklyn-master-build-docker/builds/1188/testng/testng-results-1.xml'
Processing '/x1/jenkins/jenkins-home/jobs/brooklyn-master-build-docker/builds/1188/testng/testng-results-10.xml'
Processing '/x1/jenkins/jenkins-home/jobs/brooklyn-master-build-docker/builds/1188/testng/testng-results-11.xml'
Processing '/x1/jenkins/jenkins-home/jobs/brooklyn-master-build-docker/builds/1188/testng/testng-results-2.xml'
Processing '/x1/jenkins/jenkins-home/jobs/brooklyn-master-build-docker/builds/1188/testng/testng-results-3.xml'
Processing '/x1/jenkins/jenkins-home/jobs/brooklyn-master-build-docker/builds/1188/testng/testng-results-4.xml'
Processing '/x1/jenkins/jenkins-home/jobs/brooklyn-master-build-docker/builds/1188/testng/testng-results-5.xml'
Processing '/x1/jenkins/jenkins-home/jobs/brooklyn-master-build-docker/builds/1188/testng/testng-results-6.xml'
Processing '/x1/jenkins/jenkins-home/jobs/brooklyn-master-build-docker/builds/1188/testng/testng-results-7.xml'
Processing '/x1/jenkins/jenkins-home/jobs/brooklyn-master-build-docker/builds/1188/testng/testng-results-8.xml'
Processing '/x1/jenkins/jenkins-home/jobs/brooklyn-master-build-docker/builds/1188/testng/testng-results-9.xml'
Processing '/x1/jenkins/jenkins-home/jobs/brooklyn-master-build-docker/builds/1188/testng/testng-results.xml'
0.028185% of tests failed, which exceeded threshold of 0%. Marking build as UNSTABLE
TestNG Reports Processing: FINISH