git.net

[Date Prev][Date Next][Thread Prev][Thread Next][Date Index][Thread Index]

Build failed in Jenkins: brooklyn-master-build-docker #1146


See <https://builds.apache.org/job/brooklyn-master-build-docker/1146/display/redirect>

------------------------------------------
[...truncated 6.16 MB...]
2018-12-13 16:04:09,135 INFO  - TESTNG INVOKING CONFIGURATION: "Surefire test" - @AfterMethod org.apache.brooklyn.core.mgmt.rebind.RebindTestFixture.tearDown()
2018-12-13 16:04:09,145 INFO  - TESTNG PASSED CONFIGURATION: "Surefire test" - @AfterMethod org.apache.brooklyn.core.mgmt.rebind.RebindTestFixture.tearDown() finished in 9 ms
2018-12-13 16:04:09,145 INFO  - TESTNG INVOKING CONFIGURATION: "Surefire test" - @BeforeMethod org.apache.brooklyn.core.test.BrooklynAppUnitTestSupport.setUp()
2018-12-13 16:04:09,145 INFO  - Added external config supplier named 'brooklyn-demo-sample': org.apache.brooklyn.core.config.external.InPlaceExternalConfigSupplier@639c7ab9
2018-12-13 16:04:09,156 INFO  - TESTNG PASSED CONFIGURATION: "Surefire test" - @BeforeMethod org.apache.brooklyn.core.test.BrooklynAppUnitTestSupport.setUp() finished in 11 ms
2018-12-13 16:04:09,156 INFO  - TESTNG INVOKING CONFIGURATION: "Surefire test" - @BeforeMethod org.apache.brooklyn.core.sensor.password.CreatePasswordSensorTest.setup()
2018-12-13 16:04:09,189 INFO  - TESTNG PASSED CONFIGURATION: "Surefire test" - @BeforeMethod org.apache.brooklyn.core.sensor.password.CreatePasswordSensorTest.setup() finished in 33 ms
2018-12-13 16:04:09,189 INFO  - TESTNG INVOKING: "Surefire test" - org.apache.brooklyn.core.sensor.password.CreatePasswordSensorTest.testCreatePasswordCharacterGroups()
2018-12-13 16:04:09,194 INFO  - TESTNG PASSED: "Surefire test" - org.apache.brooklyn.core.sensor.password.CreatePasswordSensorTest.testCreatePasswordCharacterGroups() finished in 4 ms
2018-12-13 16:04:09,194 INFO  - TESTNG INVOKING CONFIGURATION: "Surefire test" - @AfterMethod org.apache.brooklyn.core.test.BrooklynMgmtUnitTestSupport.tearDown()
2018-12-13 16:04:09,198 INFO  - TESTNG PASSED CONFIGURATION: "Surefire test" - @AfterMethod org.apache.brooklyn.core.test.BrooklynMgmtUnitTestSupport.tearDown() finished in 4 ms
2018-12-13 16:04:09,199 INFO  - TESTNG INVOKING CONFIGURATION: "Surefire test" - @BeforeMethod org.apache.brooklyn.core.test.BrooklynAppUnitTestSupport.setUp()
2018-12-13 16:04:09,199 INFO  - Added external config supplier named 'brooklyn-demo-sample': org.apache.brooklyn.core.config.external.InPlaceExternalConfigSupplier@737dbab0
2018-12-13 16:04:09,211 INFO  - TESTNG PASSED CONFIGURATION: "Surefire test" - @BeforeMethod org.apache.brooklyn.core.test.BrooklynAppUnitTestSupport.setUp() finished in 12 ms
2018-12-13 16:04:09,211 INFO  - TESTNG INVOKING CONFIGURATION: "Surefire test" - @BeforeMethod org.apache.brooklyn.core.sensor.password.CreatePasswordSensorTest.setup()
2018-12-13 16:04:09,241 INFO  - TESTNG PASSED CONFIGURATION: "Surefire test" - @BeforeMethod org.apache.brooklyn.core.sensor.password.CreatePasswordSensorTest.setup() finished in 30 ms
2018-12-13 16:04:09,241 INFO  - TESTNG INVOKING: "Surefire test" - org.apache.brooklyn.core.sensor.password.CreatePasswordSensorTest.testCreatePasswordCreatesAPasswordOfDefaultLength()
2018-12-13 16:04:09,242 INFO  - TESTNG PASSED: "Surefire test" - org.apache.brooklyn.core.sensor.password.CreatePasswordSensorTest.testCreatePasswordCreatesAPasswordOfDefaultLength() finished in 1 ms
2018-12-13 16:04:09,242 INFO  - TESTNG INVOKING CONFIGURATION: "Surefire test" - @AfterMethod org.apache.brooklyn.core.test.BrooklynMgmtUnitTestSupport.tearDown()
2018-12-13 16:04:09,246 INFO  - TESTNG PASSED CONFIGURATION: "Surefire test" - @AfterMethod org.apache.brooklyn.core.test.BrooklynMgmtUnitTestSupport.tearDown() finished in 4 ms
2018-12-13 16:04:09,246 INFO  - TESTNG INVOKING CONFIGURATION: "Surefire test" - @BeforeMethod org.apache.brooklyn.core.test.BrooklynAppUnitTestSupport.setUp()
2018-12-13 16:04:09,247 INFO  - Added external config supplier named 'brooklyn-demo-sample': org.apache.brooklyn.core.config.external.InPlaceExternalConfigSupplier@4efc0e7c
2018-12-13 16:04:09,257 INFO  - TESTNG PASSED CONFIGURATION: "Surefire test" - @BeforeMethod org.apache.brooklyn.core.test.BrooklynAppUnitTestSupport.setUp() finished in 11 ms
2018-12-13 16:04:09,257 INFO  - TESTNG INVOKING: "Surefire test" - org.apache.brooklyn.core.sensor.DurationSinceSensorTest.testSensorAddedAndUpdated()
2018-12-13 16:04:09,336 INFO  - TESTNG PASSED: "Surefire test" - org.apache.brooklyn.core.sensor.DurationSinceSensorTest.testSensorAddedAndUpdated() finished in 79 ms
2018-12-13 16:04:09,336 INFO  - TESTNG INVOKING CONFIGURATION: "Surefire test" - @AfterMethod org.apache.brooklyn.core.test.BrooklynMgmtUnitTestSupport.tearDown()
2018-12-13 16:04:09,341 INFO  - TESTNG PASSED CONFIGURATION: "Surefire test" - @AfterMethod org.apache.brooklyn.core.test.BrooklynMgmtUnitTestSupport.tearDown() finished in 5 ms
2018-12-13 16:04:09,342 INFO  - TESTNG INVOKING CONFIGURATION: "Surefire test" - @BeforeMethod org.apache.brooklyn.core.sensor.http.HttpRequestSensorTest.setUp()
2018-12-13 16:04:09,344 INFO  - Added external config supplier named 'brooklyn-demo-sample': org.apache.brooklyn.core.config.external.InPlaceExternalConfigSupplier@73ae0026
2018-12-13 16:04:09,379 INFO  - TESTNG PASSED CONFIGURATION: "Surefire test" - @BeforeMethod org.apache.brooklyn.core.sensor.http.HttpRequestSensorTest.setUp() finished in 38 ms
2018-12-13 16:04:09,379 INFO  - TESTNG INVOKING: "Surefire test" - org.apache.brooklyn.core.sensor.http.HttpRequestSensorTest.testDoNotParseJson()
2018-12-13 16:04:09,409 INFO  - TESTNG PASSED: "Surefire test" - org.apache.brooklyn.core.sensor.http.HttpRequestSensorTest.testDoNotParseJson() finished in 30 ms
2018-12-13 16:04:09,409 INFO  - TESTNG INVOKING CONFIGURATION: "Surefire test" - @AfterMethod org.apache.brooklyn.core.sensor.http.HttpRequestSensorTest.tearDown()
2018-12-13 16:04:09,414 INFO  - TESTNG PASSED CONFIGURATION: "Surefire test" - @AfterMethod org.apache.brooklyn.core.sensor.http.HttpRequestSensorTest.tearDown() finished in 5 ms
2018-12-13 16:04:09,414 INFO  - TESTNG INVOKING CONFIGURATION: "Surefire test" - @BeforeMethod org.apache.brooklyn.core.sensor.http.HttpRequestSensorTest.setUp()
2018-12-13 16:04:09,415 INFO  - Added external config supplier named 'brooklyn-demo-sample': org.apache.brooklyn.core.config.external.InPlaceExternalConfigSupplier@5365cefd
2018-12-13 16:04:09,449 INFO  - TESTNG PASSED CONFIGURATION: "Surefire test" - @BeforeMethod org.apache.brooklyn.core.sensor.http.HttpRequestSensorTest.setUp() finished in 35 ms
2018-12-13 16:04:09,449 INFO  - TESTNG INVOKING: "Surefire test" - org.apache.brooklyn.core.sensor.http.HttpRequestSensorTest.testHttpSensor()
2018-12-13 16:04:09,457 INFO  - TESTNG PASSED: "Surefire test" - org.apache.brooklyn.core.sensor.http.HttpRequestSensorTest.testHttpSensor() finished in 8 ms
2018-12-13 16:04:09,457 INFO  - TESTNG INVOKING CONFIGURATION: "Surefire test" - @AfterMethod org.apache.brooklyn.core.sensor.http.HttpRequestSensorTest.tearDown()
2018-12-13 16:04:09,462 INFO  - TESTNG PASSED CONFIGURATION: "Surefire test" - @AfterMethod org.apache.brooklyn.core.sensor.http.HttpRequestSensorTest.tearDown() finished in 5 ms
2018-12-13 16:04:09,463 INFO  - TESTNG INVOKING CONFIGURATION: "Surefire test" - @BeforeMethod org.apache.brooklyn.core.sensor.http.HttpRequestSensorTest.setUp()
2018-12-13 16:04:09,464 INFO  - Added external config supplier named 'brooklyn-demo-sample': org.apache.brooklyn.core.config.external.InPlaceExternalConfigSupplier@790387fb
2018-12-13 16:04:09,501 INFO  - TESTNG PASSED CONFIGURATION: "Surefire test" - @BeforeMethod org.apache.brooklyn.core.sensor.http.HttpRequestSensorTest.setUp() finished in 38 ms
2018-12-13 16:04:09,502 INFO  - TESTNG INVOKING: "Surefire test" - org.apache.brooklyn.core.sensor.http.HttpRequestSensorTest.testNonJson()
2018-12-13 16:04:09,510 INFO  - TESTNG PASSED: "Surefire test" - org.apache.brooklyn.core.sensor.http.HttpRequestSensorTest.testNonJson() finished in 8 ms
2018-12-13 16:04:09,510 INFO  - TESTNG INVOKING CONFIGURATION: "Surefire test" - @AfterMethod org.apache.brooklyn.core.sensor.http.HttpRequestSensorTest.tearDown()
2018-12-13 16:04:09,516 INFO  - TESTNG PASSED CONFIGURATION: "Surefire test" - @AfterMethod org.apache.brooklyn.core.sensor.http.HttpRequestSensorTest.tearDown() finished in 6 ms
2018-12-13 16:04:09,517 INFO  - TESTNG INVOKING CONFIGURATION: "Surefire test" - @BeforeMethod org.apache.brooklyn.core.sensor.http.HttpRequestSensorTest.setUp()
2018-12-13 16:04:09,518 INFO  - Added external config supplier named 'brooklyn-demo-sample': org.apache.brooklyn.core.config.external.InPlaceExternalConfigSupplier@5881473f
2018-12-13 16:04:09,558 INFO  - TESTNG PASSED CONFIGURATION: "Surefire test" - @BeforeMethod org.apache.brooklyn.core.sensor.http.HttpRequestSensorTest.setUp() finished in 42 ms
2018-12-13 16:04:09,559 INFO  - TESTNG INVOKING: "Surefire test" - org.apache.brooklyn.core.sensor.http.HttpRequestSensorTest.testPreemptiveBasicAuth()
2018-12-13 16:04:09,568 INFO  - TESTNG PASSED: "Surefire test" - org.apache.brooklyn.core.sensor.http.HttpRequestSensorTest.testPreemptiveBasicAuth() finished in 9 ms
2018-12-13 16:04:09,568 INFO  - TESTNG INVOKING CONFIGURATION: "Surefire test" - @AfterMethod org.apache.brooklyn.core.sensor.http.HttpRequestSensorTest.tearDown()
2018-12-13 16:04:09,576 INFO  - TESTNG PASSED CONFIGURATION: "Surefire test" - @AfterMethod org.apache.brooklyn.core.sensor.http.HttpRequestSensorTest.tearDown() finished in 8 ms
2018-12-13 16:04:09,577 INFO  - TESTNG INVOKING CONFIGURATION: "Surefire test" - @BeforeMethod org.apache.brooklyn.core.test.BrooklynAppUnitTestSupport.setUp()
2018-12-13 16:04:09,577 INFO  - Added external config supplier named 'brooklyn-demo-sample': org.apache.brooklyn.core.config.external.InPlaceExternalConfigSupplier@7487ff18
2018-12-13 16:04:09,588 INFO  - TESTNG PASSED CONFIGURATION: "Surefire test" - @BeforeMethod org.apache.brooklyn.core.test.BrooklynAppUnitTestSupport.setUp() finished in 11 ms
2018-12-13 16:04:09,588 INFO  - TESTNG INVOKING: "Surefire test" - org.apache.brooklyn.core.sensor.MaxConcurrencySensorTest.testAddsStaticSensorOfTypeString()
2018-12-13 16:04:09,602 INFO  - TESTNG PASSED: "Surefire test" - org.apache.brooklyn.core.sensor.MaxConcurrencySensorTest.testAddsStaticSensorOfTypeString() finished in 14 ms
2018-12-13 16:04:09,602 INFO  - TESTNG INVOKING CONFIGURATION: "Surefire test" - @AfterMethod org.apache.brooklyn.core.test.BrooklynMgmtUnitTestSupport.tearDown()
2018-12-13 16:04:09,605 INFO  - TESTNG PASSED CONFIGURATION: "Surefire test" - @AfterMethod org.apache.brooklyn.core.test.BrooklynMgmtUnitTestSupport.tearDown() finished in 3 ms
2018-12-13 16:04:09,606 INFO  - TESTNG INVOKING CONFIGURATION: "Surefire test" - @BeforeMethod org.apache.brooklyn.core.test.BrooklynAppUnitTestSupport.setUp()
2018-12-13 16:04:09,606 INFO  - Added external config supplier named 'brooklyn-demo-sample': org.apache.brooklyn.core.config.external.InPlaceExternalConfigSupplier@10683579
2018-12-13 16:04:09,616 INFO  - TESTNG PASSED CONFIGURATION: "Surefire test" - @BeforeMethod org.apache.brooklyn.core.test.BrooklynAppUnitTestSupport.setUp() finished in 10 ms
2018-12-13 16:04:09,616 INFO  - TESTNG INVOKING: "Surefire test" - org.apache.brooklyn.core.sensor.SensorEventPredicatesTest.testSensorEqualTo()
2018-12-13 16:04:09,617 INFO  - TESTNG PASSED: "Surefire test" - org.apache.brooklyn.core.sensor.SensorEventPredicatesTest.testSensorEqualTo() finished in 1 ms
2018-12-13 16:04:09,618 INFO  - TESTNG INVOKING CONFIGURATION: "Surefire test" - @AfterMethod org.apache.brooklyn.core.test.BrooklynMgmtUnitTestSupport.tearDown()
2018-12-13 16:04:09,620 INFO  - TESTNG PASSED CONFIGURATION: "Surefire test" - @AfterMethod org.apache.brooklyn.core.test.BrooklynMgmtUnitTestSupport.tearDown() finished in 2 ms
2018-12-13 16:04:09,621 INFO  - TESTNG INVOKING CONFIGURATION: "Surefire test" - @BeforeMethod org.apache.brooklyn.core.test.BrooklynAppUnitTestSupport.setUp()
2018-12-13 16:04:09,621 INFO  - Added external config supplier named 'brooklyn-demo-sample': org.apache.brooklyn.core.config.external.InPlaceExternalConfigSupplier@317859de
2018-12-13 16:04:09,632 INFO  - TESTNG PASSED CONFIGURATION: "Surefire test" - @BeforeMethod org.apache.brooklyn.core.test.BrooklynAppUnitTestSupport.setUp() finished in 11 ms
2018-12-13 16:04:09,632 INFO  - TESTNG INVOKING: "Surefire test" - org.apache.brooklyn.core.sensor.SensorEventPredicatesTest.testSensorSatisfies()
2018-12-13 16:04:09,632 INFO  - TESTNG PASSED: "Surefire test" - org.apache.brooklyn.core.sensor.SensorEventPredicatesTest.testSensorSatisfies() finished in 0 ms
2018-12-13 16:04:09,632 INFO  - TESTNG INVOKING CONFIGURATION: "Surefire test" - @AfterMethod org.apache.brooklyn.core.test.BrooklynMgmtUnitTestSupport.tearDown()
2018-12-13 16:04:09,635 INFO  - TESTNG PASSED CONFIGURATION: "Surefire test" - @AfterMethod org.apache.brooklyn.core.test.BrooklynMgmtUnitTestSupport.tearDown() finished in 3 ms
2018-12-13 16:04:09,636 INFO  - TESTNG INVOKING CONFIGURATION: "Surefire test" - @BeforeMethod org.apache.brooklyn.core.test.BrooklynAppUnitTestSupport.setUp()
2018-12-13 16:04:09,636 INFO  - Added external config supplier named 'brooklyn-demo-sample': org.apache.brooklyn.core.config.external.InPlaceExternalConfigSupplier@3239c805
2018-12-13 16:04:09,647 INFO  - TESTNG PASSED CONFIGURATION: "Surefire test" - @BeforeMethod org.apache.brooklyn.core.test.BrooklynAppUnitTestSupport.setUp() finished in 11 ms
2018-12-13 16:04:09,647 INFO  - TESTNG INVOKING: "Surefire test" - org.apache.brooklyn.core.sensor.SensorEventPredicatesTest.testValueEqualTo()
2018-12-13 16:04:09,648 INFO  - TESTNG PASSED: "Surefire test" - org.apache.brooklyn.core.sensor.SensorEventPredicatesTest.testValueEqualTo() finished in 1 ms
2018-12-13 16:04:09,648 INFO  - TESTNG INVOKING CONFIGURATION: "Surefire test" - @AfterMethod org.apache.brooklyn.core.test.BrooklynMgmtUnitTestSupport.tearDown()
2018-12-13 16:04:09,651 INFO  - TESTNG PASSED CONFIGURATION: "Surefire test" - @AfterMethod org.apache.brooklyn.core.test.BrooklynMgmtUnitTestSupport.tearDown() finished in 3 ms
2018-12-13 16:04:09,651 INFO  - TESTNG INVOKING CONFIGURATION: "Surefire test" - @BeforeMethod org.apache.brooklyn.core.test.BrooklynAppUnitTestSupport.setUp()
2018-12-13 16:04:09,651 INFO  - Added external config supplier named 'brooklyn-demo-sample': org.apache.brooklyn.core.config.external.InPlaceExternalConfigSupplier@53f907eb
2018-12-13 16:04:09,662 INFO  - TESTNG PASSED CONFIGURATION: "Surefire test" - @BeforeMethod org.apache.brooklyn.core.test.BrooklynAppUnitTestSupport.setUp() finished in 11 ms
2018-12-13 16:04:09,662 INFO  - TESTNG INVOKING: "Surefire test" - org.apache.brooklyn.core.sensor.SensorEventPredicatesTest.testValueSatisfies()
2018-12-13 16:04:09,662 INFO  - TESTNG PASSED: "Surefire test" - org.apache.brooklyn.core.sensor.SensorEventPredicatesTest.testValueSatisfies() finished in 0 ms
2018-12-13 16:04:09,662 INFO  - TESTNG INVOKING CONFIGURATION: "Surefire test" - @AfterMethod org.apache.brooklyn.core.test.BrooklynMgmtUnitTestSupport.tearDown()
2018-12-13 16:04:09,666 INFO  - TESTNG PASSED CONFIGURATION: "Surefire test" - @AfterMethod org.apache.brooklyn.core.test.BrooklynMgmtUnitTestSupport.tearDown() finished in 4 ms
2018-12-13 16:04:09,887 INFO  - TESTNG 
===============================================
    Surefire test
    Tests run: 2348, Failures: 1, Skips: 0
===============================================
[GC (Allocation Failure)  398456K->178464K(765440K), 0.0325253 secs]
[GC (Allocation Failure)  399136K->174183K(766976K), 0.0093449 secs]
[GC (Allocation Failure)  396903K->174499K(766464K), 0.0077173 secs]
[GC (Allocation Failure)  397219K->174347K(766976K), 0.0119486 secs]
[GC (Allocation Failure)  397579K->174427K(766976K), 0.0268535 secs]
[GC (Allocation Failure)  397659K->174267K(768000K), 0.0324813 secs]
Tests run: 2348, Failures: 1, Errors: 0, Skipped: 0, Time elapsed: 215.282 sec <<< FAILURE! - in TestSuite
testUnsubmittedTaskWithExecutionContextTimesOutWhenImmediate(org.apache.brooklyn.util.core.task.ValueResolverTest)  Time elapsed: 0.016 sec  <<< FAILURE!
java.lang.AssertionError: result=Absent[] expected [true] but found [false]
	at org.apache.brooklyn.util.core.task.ValueResolverTest.testUnsubmittedTaskWithExecutionContextTimesOutWhenImmediate(ValueResolverTest.java:159)

2018-12-13 16:04:12,974 INFO  - Brooklyn shutdown: stopping entities [TestEntityImpl{id=ywwhkpsoix}, TestEntityImpl{id=gulhr1t98f}, BlockingEntityImpl{id=dnackxk3h7}]

Results :

Failed tests: 
  ValueResolverTest.testUnsubmittedTaskWithExecutionContextTimesOutWhenImmediate:159 result=Absent[] expected [true] but found [false]

Tests run: 2348, Failures: 1, Errors: 0, Skipped: 0

[INFO] ------------------------------------------------------------------------
[INFO] Reactor Summary:
[INFO] 
[INFO] Brooklyn Server Root ............................... SUCCESS [  4.346 s]
[INFO] Brooklyn Parent Project ............................ SUCCESS [  4.991 s]
[INFO] Brooklyn Test Support Utilities .................... SUCCESS [  8.171 s]
[INFO] Brooklyn Logback Includable Configuration .......... SUCCESS [  0.446 s]
[INFO] Brooklyn Common Utilities .......................... SUCCESS [ 29.905 s]
[INFO] Brooklyn API ....................................... SUCCESS [  3.340 s]
[INFO] CAMP Server Parent Project ......................... SUCCESS [  0.100 s]
[INFO] CAMP Base .......................................... SUCCESS [  3.473 s]
[INFO] Brooklyn Test Support .............................. SUCCESS [  2.273 s]
[INFO] Brooklyn REST Swagger Apidoc Utilities ............. SUCCESS [ 14.224 s]
[INFO] Brooklyn Logback Configuration ..................... SUCCESS [  0.211 s]
[INFO] CAMP Server ........................................ SUCCESS [ 13.641 s]
[INFO] Brooklyn Felix Runtime ............................. SUCCESS [  3.342 s]
[INFO] Brooklyn Groovy Utilities .......................... SUCCESS [  2.056 s]
[INFO] Brooklyn Core ...................................... FAILURE [04:28 min]
[INFO] Brooklyn Policies .................................. SKIPPED
[INFO] Brooklyn WinRM Software Entities ................... SKIPPED
[INFO] Brooklyn Secure JMXMP Agent ........................ SKIPPED
[INFO] Brooklyn JMX RMI Agent ............................. SKIPPED
[INFO] Brooklyn Jclouds Location Targets .................. SKIPPED
[INFO] Brooklyn Software Base ............................. SKIPPED
[INFO] Brooklyn CAMP ...................................... SKIPPED
[INFO] Brooklyn Launcher Common ........................... SKIPPED
[INFO] Brooklyn REST API .................................. SKIPPED
[INFO] Brooklyn REST Resources ............................ SKIPPED
[INFO] Brooklyn REST Server ............................... SKIPPED
[INFO] Brooklyn Launcher .................................. SKIPPED
[INFO] Brooklyn Container Location Targets ................ SKIPPED
[INFO] Brooklyn Command Line Interface .................... SKIPPED
[INFO] Brooklyn Test Framework ............................ SKIPPED
[INFO] Brooklyn OSGi init ................................. SKIPPED
[INFO] Brooklyn OSGi start ................................ SKIPPED
[INFO] Brooklyn Karaf ..................................... SKIPPED
[INFO] Jetty config fragment .............................. SKIPPED
[INFO] Apache Http Component extension .................... SKIPPED
[INFO] Brooklyn Karaf Features ............................ SKIPPED
[INFO] Brooklyn Karaf Shell Commands ...................... SKIPPED
[INFO] Brooklyn UI :: Parent .............................. SKIPPED
[INFO] Brooklyn UI :: Modularity Server (parent) .......... SKIPPED
[INFO] Brooklyn UI :: Modularity Server :: UI Module API .. SKIPPED
[INFO] Brooklyn UI :: Modularity Server :: UI Module Registry SKIPPED
[INFO] Brooklyn UI :: Modularity Server :: UI Proxy ....... SKIPPED
[INFO] Brooklyn UI :: Modularity Server :: UI Metadata Registry SKIPPED
[INFO] Brooklyn UI :: Modularity Server :: External UI Modules Registration Hooks SKIPPED
[INFO] Brooklyn UI :: Modularity Server :: Features ....... SKIPPED
[INFO] Brooklyn UI :: Modules (parent) .................... SKIPPED
[INFO] Brooklyn UI :: Modules - UI Utils .................. SKIPPED
[INFO] Brooklyn UI :: Modules - Home ...................... SKIPPED
[INFO] Brooklyn UI :: Modules - App inspector ............. SKIPPED
[INFO] Brooklyn UI :: Modules - Blueprint composer ........ SKIPPED
[INFO] Brooklyn UI :: Modules - Blueprint importer ........ SKIPPED
[INFO] Brooklyn UI :: Modules - Catalog ................... SKIPPED
[INFO] Brooklyn UI :: Modules - Location manager .......... SKIPPED
[INFO] Brooklyn UI :: Modules - REST API Docs ............. SKIPPED
[INFO] Brooklyn UI :: Modules - Groovy console ............ SKIPPED
[INFO] Brooklyn UI :: Modules - Logout .................... SKIPPED
[INFO] Brooklyn UI :: Modules - Features .................. SKIPPED
[INFO] Brooklyn UI :: Features ............................ SKIPPED
[INFO] Brooklyn Library Root .............................. SKIPPED
[INFO] Brooklyn CM Chef ................................... SKIPPED
[INFO] Brooklyn CM SaltStack .............................. SKIPPED
[INFO] Brooklyn CM Ansible ................................ SKIPPED
[INFO] Brooklyn CM Integration Root ....................... SKIPPED
[INFO] Brooklyn Network Software Entities ................. SKIPPED
[INFO] Brooklyn OSGi Software Entities .................... SKIPPED
[INFO] Brooklyn Database Software Entities ................ SKIPPED
[INFO] Brooklyn Web App Software Entities ................. SKIPPED
[INFO] Brooklyn Messaging Software Entities ............... SKIPPED
[INFO] Brooklyn NoSQL Data Store Software Entities ........ SKIPPED
[INFO] Brooklyn Monitoring Software Entities .............. SKIPPED
[INFO] Brooklyn Web App Software Entities ................. SKIPPED
[INFO] Brooklyn QA ........................................ SKIPPED
[INFO] Brooklyn Examples Aggregator Project ............... SKIPPED
[INFO] Brooklyn Examples Aggregator Project - Webapps ..... SKIPPED
[INFO] hello-world-webapp Maven Webapp .................... SKIPPED
[INFO] hello-world-sql-webapp Maven Webapp ................ SKIPPED
[INFO] Brooklyn Simple Web Cluster Example ................ SKIPPED
[INFO] Brooklyn Library Karaf integration ................. SKIPPED
[INFO] Brooklyn Library Catalog ........................... SKIPPED
[INFO] Brooklyn Library Karaf Features .................... SKIPPED
[INFO] Brooklyn Client .................................... SKIPPED
[INFO] Brooklyn Client Command Line Interface ............. SKIPPED
[INFO] Brooklyn REST java Client .......................... SKIPPED
[INFO] Brooklyn Downstream Project Parent ................. SKIPPED
[INFO] Brooklyn Dist Root ................................. SKIPPED
[INFO] Brooklyn All Things ................................ SKIPPED
[INFO] Brooklyn Distribution .............................. SKIPPED
[INFO] Brooklyn Karaf Distribution Parent ................. SKIPPED
[INFO] Brooklyn Karaf Server Configuration ................ SKIPPED
[INFO] Brooklyn Dist Karaf Features ....................... SKIPPED
[INFO] Brooklyn Karaf Distribution ........................ SKIPPED
[INFO] Brooklyn Karaf pax-exam itest ...................... SKIPPED
[INFO] Brooklyn Vagrant Getting Started Environment ....... SKIPPED
[INFO] Brooklyn Quick-Start Project Archetype ............. SKIPPED
[INFO] Brooklyn Shared Package Files ...................... SKIPPED
[INFO] Brooklyn RPM Package ............................... SKIPPED
[INFO] Brooklyn DEB Package ............................... SKIPPED
[INFO] Brooklyn Root 1.0.0-SNAPSHOT ....................... SKIPPED
[INFO] ------------------------------------------------------------------------
[INFO] BUILD FAILURE
[INFO] ------------------------------------------------------------------------
[INFO] Total time: 06:22 min
[INFO] Finished at: 2018-12-13T16:04:13Z
[INFO] ------------------------------------------------------------------------
[ERROR] Failed to execute goal org.apache.maven.plugins:maven-surefire-plugin:2.19.1:test (default-test) on project brooklyn-core: There are test failures.
[ERROR] 
[ERROR] Please refer to /usr/build/brooklyn-server/core/target/surefire-reports for the individual test results.
[ERROR] -> [Help 1]
[ERROR] 
[ERROR] To see the full stack trace of the errors, re-run Maven with the -e switch.
[ERROR] Re-run Maven using the -X switch to enable full debug logging.
[ERROR] 
[ERROR] For more information about the errors and possible solutions, please read the following articles:
[ERROR] [Help 1] http://cwiki.apache.org/confluence/display/MAVEN/MojoFailureException
[ERROR] 
[ERROR] After correcting the problems, you can resume the build with the command
[ERROR]   mvn <goals> -rf :brooklyn-core
Build step 'Execute shell' marked build as failure
Recording test results
TestNG Reports Processing: START
Looking for TestNG results report in workspace using pattern: **/testng-results.xml
Saving reports...
Processing '/x1/jenkins/jenkins-home/jobs/brooklyn-master-build-docker/builds/1146/testng/testng-results-1.xml'
Processing '/x1/jenkins/jenkins-home/jobs/brooklyn-master-build-docker/builds/1146/testng/testng-results-2.xml'
Processing '/x1/jenkins/jenkins-home/jobs/brooklyn-master-build-docker/builds/1146/testng/testng-results-3.xml'
Processing '/x1/jenkins/jenkins-home/jobs/brooklyn-master-build-docker/builds/1146/testng/testng-results-4.xml'
Processing '/x1/jenkins/jenkins-home/jobs/brooklyn-master-build-docker/builds/1146/testng/testng-results-5.xml'
Processing '/x1/jenkins/jenkins-home/jobs/brooklyn-master-build-docker/builds/1146/testng/testng-results-6.xml'
Processing '/x1/jenkins/jenkins-home/jobs/brooklyn-master-build-docker/builds/1146/testng/testng-results.xml'
0.033807% of tests failed, which exceeded threshold of 0%. Marking build as UNSTABLE
TestNG Reports Processing: FINISH