git.net

[Date Prev][Date Next][Thread Prev][Thread Next][Date Index][Thread Index]

Build failed in Jenkins: brooklyn-master-build-docker #1132


See <https://builds.apache.org/job/brooklyn-master-build-docker/1132/display/redirect>

------------------------------------------
[...truncated 8.00 MB...]
2018-12-10 17:35:15,504 INFO  - Docker Host StubHostImpl{id=gv3q1dkia8}: member SshMachineLocation[StubContainerLocation:pdmg:null@1.2.3.4/1.2.3.4:22(id=pdmgoyk6o8)] released
2018-12-10 17:35:15,506 WARN  - Setting StubInfrastructureImpl{id=elc9tv4eup} on-fire due to problems when expected running, up=false, not-up-indicators: {service-lifecycle-indicators-from-children-and-members=DynamicGroupImpl{id=w7kpx6nkzz} is not up}
2018-12-10 17:35:15,512 WARN  - Use of deprecated ConfigKey group.members.delegate in DynamicGroupImpl{id=pv64fakwh8} (as of 0.9.0)
2018-12-10 17:35:15,515 WARN  XWwB5Q3M-[az75yslxys,s5e6jn7un5,urjrqu4vdg,qhfiea2rsx,urpl6b3xl9] Deprecated use of unmanaged location (SshMachineLocation[StubContainerLocation:tyev:null@1.2.3.4/1.2.3.4:22(id=tyev2j9n0a)]); will be managed automatically now but not supported in future versions
2018-12-10 17:35:15,516 INFO  XWwB5Q3M-[az75yslxys,s5e6jn7un5,urjrqu4vdg,qhfiea2rsx,urpl6b3xl9] Starting entity StubContainerImpl{id=urpl6b3xl9} at [SshMachineLocation[localhost:null@764b3d68a4e5/172.17.0.2:22(id=nnty0f9fk6)]]
2018-12-10 17:35:15,518 INFO  - Docker Host StubHostImpl{id=urjrqu4vdg}: member SshMachineLocation[StubContainerLocation:tyev:null@1.2.3.4/1.2.3.4:22(id=tyev2j9n0a)] released
2018-12-10 17:35:15,520 WARN  - Setting StubInfrastructureImpl{id=az75yslxys} on-fire due to problems when expected running, up=false, not-up-indicators: {}
2018-12-10 17:35:15,522 INFO  - TESTNG PASSED: "Surefire test" - org.apache.brooklyn.core.location.dynamic.clocker.ClockerDynamicLocationPatternRebindTest.testRebind() finished in 11231 ms
2018-12-10 17:35:15,522 INFO  - TESTNG INVOKING CONFIGURATION: "Surefire test" - @AfterMethod org.apache.brooklyn.core.mgmt.rebind.RebindTestFixture.tearDown()
2018-12-10 17:35:15,529 INFO  TsYMU6H2-[elc9tv4eup,j1cet10onc,gv3q1dkia8] Stopping StubHostImpl{id=gv3q1dkia8} in [LocalhostMachineProvisioningLocation{id=lzocjyjw1g, name=localhost}, SshMachineLocation[localhost:null@764b3d68a4e5/172.17.0.2:22(id=kdnbovz2yf)]]
2018-12-10 17:35:15,531 INFO  mGDy8oj7-[y4abf65tag,smljsd5o40,d06xori0ot] Stopping StubHostImpl{id=d06xori0ot} in [LocalhostMachineProvisioningLocation{id=lzocjyjw1g, name=localhost}, SshMachineLocation[localhost:null@764b3d68a4e5/172.17.0.2:22(id=cg4t8t3stw)]]
2018-12-10 17:35:15,531 INFO  WJLcw3vA-[vum20jwdx7,p16o377ywq,nq8th6ui8v] Stopping StubHostImpl{id=nq8th6ui8v} in [LocalhostMachineProvisioningLocation{id=lzocjyjw1g, name=localhost}, SshMachineLocation[localhost:null@764b3d68a4e5/172.17.0.2:22(id=wntx8pgzcl)]]
2018-12-10 17:35:15,531 INFO  a0TBbk37-[nui4dq6ev3,oy3duq7745,kj5gm2n4es] Stopping StubHostImpl{id=kj5gm2n4es} in [LocalhostMachineProvisioningLocation{id=lzocjyjw1g, name=localhost}, SshMachineLocation[localhost:null@764b3d68a4e5/172.17.0.2:22(id=yikbpqsrby)]]
2018-12-10 17:35:15,533 INFO  OiFP6eDF-[toptt1oeyo,uotltoonab,v8zdcluxqm] Stopping StubHostImpl{id=v8zdcluxqm} in [LocalhostMachineProvisioningLocation{id=lzocjyjw1g, name=localhost}, SshMachineLocation[localhost:null@764b3d68a4e5/172.17.0.2:22(id=xhris6mjwa)]]
2018-12-10 17:35:15,533 INFO  T275c7Eu-[wvalq7d4ak,sai2cjyww5,fuwrl6djc6] Stopping StubHostImpl{id=fuwrl6djc6} in [LocalhostMachineProvisioningLocation{id=lzocjyjw1g, name=localhost}, SshMachineLocation[localhost:null@764b3d68a4e5/172.17.0.2:22(id=xdve725757)]]
2018-12-10 17:35:15,533 INFO  wACP2iZe-[lt1gu4c4gy,t0vztaf1pk,pmdaa46k8p] Stopping StubHostImpl{id=pmdaa46k8p} in [LocalhostMachineProvisioningLocation{id=lzocjyjw1g, name=localhost}, SshMachineLocation[localhost:null@764b3d68a4e5/172.17.0.2:22(id=dtgblwe2ok)]]
2018-12-10 17:35:15,538 INFO  d0qPu1A1-[kh3h8eon8z,anly8uo53j,dz8dfepdft] Stopping StubHostImpl{id=dz8dfepdft} in [LocalhostMachineProvisioningLocation{id=lzocjyjw1g, name=localhost}, SshMachineLocation[localhost:null@764b3d68a4e5/172.17.0.2:22(id=edkss5deeu)]]
2018-12-10 17:35:15,553 INFO  WG1zbuKm-[sx7cywhd60,k7u9flt9am,pos78sk1kv] Stopping StubHostImpl{id=pos78sk1kv} in [LocalhostMachineProvisioningLocation{id=lzocjyjw1g, name=localhost}, SshMachineLocation[localhost:null@764b3d68a4e5/172.17.0.2:22(id=xmoxyzozis)]]
2018-12-10 17:35:15,560 INFO  BmEjgai5-[sx7cywhd60] Stopping application StubInfrastructureImpl{id=sx7cywhd60}
2018-12-10 17:35:15,562 INFO  OKKF4k6a-[sx7cywhd60,k7u9flt9am,pos78sk1kv] Stopping StubHostImpl{id=pos78sk1kv} in [LocalhostMachineProvisioningLocation{id=lzocjyjw1g, name=localhost}]
2018-12-10 17:35:15,565 INFO  BmEjgai5-[sx7cywhd60] Stopped application StubInfrastructureImpl{id=sx7cywhd60}
2018-12-10 17:35:15,582 INFO  T3Kk5iR2-[az75yslxys,s5e6jn7un5,urjrqu4vdg] Stopping StubHostImpl{id=urjrqu4vdg} in [LocalhostMachineProvisioningLocation{id=lzocjyjw1g, name=localhost}, SshMachineLocation[localhost:null@764b3d68a4e5/172.17.0.2:22(id=nnty0f9fk6)]]
2018-12-10 17:35:15,586 INFO  BtwhCuFM-[toptt1oeyo] Stopping application StubInfrastructureImpl{id=toptt1oeyo}
2018-12-10 17:35:15,586 INFO  eg7LEBQl-[kh3h8eon8z] Stopping application StubInfrastructureImpl{id=kh3h8eon8z}
2018-12-10 17:35:15,586 INFO  atY9gb8q-[elc9tv4eup] Stopping application StubInfrastructureImpl{id=elc9tv4eup}
2018-12-10 17:35:15,587 INFO  CaWGdhnu-[vum20jwdx7] Stopping application StubInfrastructureImpl{id=vum20jwdx7}
2018-12-10 17:35:15,589 INFO  nDt1KmKS-[vum20jwdx7,p16o377ywq,nq8th6ui8v] Stopping StubHostImpl{id=nq8th6ui8v} in [LocalhostMachineProvisioningLocation{id=lzocjyjw1g, name=localhost}]
2018-12-10 17:35:15,590 INFO  Ych14BNV-[toptt1oeyo,uotltoonab,v8zdcluxqm] Stopping StubHostImpl{id=v8zdcluxqm} in [LocalhostMachineProvisioningLocation{id=lzocjyjw1g, name=localhost}]
2018-12-10 17:35:15,592 INFO  oxqiy1ln-[nui4dq6ev3] Stopping application StubInfrastructureImpl{id=nui4dq6ev3}
2018-12-10 17:35:15,593 INFO  kP73o5ge-[y4abf65tag] Stopping application StubInfrastructureImpl{id=y4abf65tag}
2018-12-10 17:35:15,594 INFO  Wwacxsxl-[az75yslxys] Stopping application StubInfrastructureImpl{id=az75yslxys}
2018-12-10 17:35:15,595 INFO  q0x63MHN-[wvalq7d4ak] Stopping application StubInfrastructureImpl{id=wvalq7d4ak}
2018-12-10 17:35:15,596 INFO  BtwhCuFM-[toptt1oeyo] Stopped application StubInfrastructureImpl{id=toptt1oeyo}
2018-12-10 17:35:15,596 INFO  XZeCIDTb-[kh3h8eon8z,anly8uo53j,dz8dfepdft] Stopping StubHostImpl{id=dz8dfepdft} in [LocalhostMachineProvisioningLocation{id=lzocjyjw1g, name=localhost}]
2018-12-10 17:35:15,597 INFO  xhMo6M7m-[nui4dq6ev3,oy3duq7745,kj5gm2n4es] Stopping StubHostImpl{id=kj5gm2n4es} in [LocalhostMachineProvisioningLocation{id=lzocjyjw1g, name=localhost}]
2018-12-10 17:35:15,596 INFO  HsuZNt88-[y4abf65tag,smljsd5o40,d06xori0ot] Stopping StubHostImpl{id=d06xori0ot} in [LocalhostMachineProvisioningLocation{id=lzocjyjw1g, name=localhost}]
2018-12-10 17:35:15,599 INFO  YetVBFAZ-[elc9tv4eup,j1cet10onc,gv3q1dkia8] Stopping StubHostImpl{id=gv3q1dkia8} in [LocalhostMachineProvisioningLocation{id=lzocjyjw1g, name=localhost}]
2018-12-10 17:35:15,600 INFO  CaWGdhnu-[vum20jwdx7] Stopped application StubInfrastructureImpl{id=vum20jwdx7}
2018-12-10 17:35:15,600 INFO  sVjMabfB-[wvalq7d4ak,sai2cjyww5,fuwrl6djc6] Stopping StubHostImpl{id=fuwrl6djc6} in [LocalhostMachineProvisioningLocation{id=lzocjyjw1g, name=localhost}]
2018-12-10 17:35:15,602 INFO  kP73o5ge-[y4abf65tag] Stopped application StubInfrastructureImpl{id=y4abf65tag}
2018-12-10 17:35:15,604 INFO  eg7LEBQl-[kh3h8eon8z] Stopped application StubInfrastructureImpl{id=kh3h8eon8z}
[GC (Allocation Failure)  260011K->75886K(748544K), 0.0545478 secs]
2018-12-10 17:35:15,665 INFO  oxqiy1ln-[nui4dq6ev3] Stopped application StubInfrastructureImpl{id=nui4dq6ev3}
2018-12-10 17:35:15,665 INFO  GhM2PgXB-[lt1gu4c4gy] Stopping application StubInfrastructureImpl{id=lt1gu4c4gy}
2018-12-10 17:35:15,666 INFO  srzrjA7Q-[az75yslxys,s5e6jn7un5,urjrqu4vdg] Stopping StubHostImpl{id=urjrqu4vdg} in [LocalhostMachineProvisioningLocation{id=lzocjyjw1g, name=localhost}]
2018-12-10 17:35:15,668 INFO  atY9gb8q-[elc9tv4eup] Stopped application StubInfrastructureImpl{id=elc9tv4eup}
2018-12-10 17:35:15,669 INFO  q0x63MHN-[wvalq7d4ak] Stopped application StubInfrastructureImpl{id=wvalq7d4ak}
2018-12-10 17:35:15,671 INFO  dLmZLK25-[lt1gu4c4gy,t0vztaf1pk,pmdaa46k8p] Stopping StubHostImpl{id=pmdaa46k8p} in [LocalhostMachineProvisioningLocation{id=lzocjyjw1g, name=localhost}]
2018-12-10 17:35:15,674 INFO  Wwacxsxl-[az75yslxys] Stopped application StubInfrastructureImpl{id=az75yslxys}
2018-12-10 17:35:15,676 INFO  GhM2PgXB-[lt1gu4c4gy] Stopped application StubInfrastructureImpl{id=lt1gu4c4gy}
2018-12-10 17:35:15,697 INFO  e2giVcVh-[wvalq7d4ak,sai2cjyww5,fuwrl6djc6] Stopping StubHostImpl{id=fuwrl6djc6} in [LocalhostMachineProvisioningLocation{id=lzocjyjw1g, name=localhost}, SshMachineLocation[localhost:null@764b3d68a4e5/172.17.0.2:22(id=xdve725757)]]
2018-12-10 17:35:15,698 INFO  G5WeJUX6-[elc9tv4eup,j1cet10onc,gv3q1dkia8] Stopping StubHostImpl{id=gv3q1dkia8} in [LocalhostMachineProvisioningLocation{id=lzocjyjw1g, name=localhost}, SshMachineLocation[localhost:null@764b3d68a4e5/172.17.0.2:22(id=kdnbovz2yf)]]
2018-12-10 17:35:15,700 INFO  c9KAGWec-[nui4dq6ev3,oy3duq7745,kj5gm2n4es] Stopping StubHostImpl{id=kj5gm2n4es} in [LocalhostMachineProvisioningLocation{id=lzocjyjw1g, name=localhost}, SshMachineLocation[localhost:null@764b3d68a4e5/172.17.0.2:22(id=yikbpqsrby)]]
2018-12-10 17:35:15,701 INFO  C7NQR0pa-[vum20jwdx7,p16o377ywq,nq8th6ui8v] Stopping StubHostImpl{id=nq8th6ui8v} in [LocalhostMachineProvisioningLocation{id=lzocjyjw1g, name=localhost}, SshMachineLocation[localhost:null@764b3d68a4e5/172.17.0.2:22(id=wntx8pgzcl)]]
2018-12-10 17:35:15,701 INFO  bk6Qu0Bl-[lt1gu4c4gy,t0vztaf1pk,pmdaa46k8p] Stopping StubHostImpl{id=pmdaa46k8p} in [LocalhostMachineProvisioningLocation{id=lzocjyjw1g, name=localhost}, SshMachineLocation[localhost:null@764b3d68a4e5/172.17.0.2:22(id=dtgblwe2ok)]]
2018-12-10 17:35:15,703 INFO  bSCUbQyi-[sx7cywhd60,k7u9flt9am,pos78sk1kv] Stopping StubHostImpl{id=pos78sk1kv} in [LocalhostMachineProvisioningLocation{id=lzocjyjw1g, name=localhost}, SshMachineLocation[localhost:null@764b3d68a4e5/172.17.0.2:22(id=xmoxyzozis)]]
2018-12-10 17:35:15,703 INFO  lVsfEvS5-[az75yslxys,s5e6jn7un5,urjrqu4vdg] Stopping StubHostImpl{id=urjrqu4vdg} in [LocalhostMachineProvisioningLocation{id=lzocjyjw1g, name=localhost}, SshMachineLocation[localhost:null@764b3d68a4e5/172.17.0.2:22(id=nnty0f9fk6)]]
2018-12-10 17:35:15,703 INFO  H2Ko140u-[kh3h8eon8z,anly8uo53j,dz8dfepdft] Stopping StubHostImpl{id=dz8dfepdft} in [LocalhostMachineProvisioningLocation{id=lzocjyjw1g, name=localhost}, SshMachineLocation[localhost:null@764b3d68a4e5/172.17.0.2:22(id=edkss5deeu)]]
2018-12-10 17:35:15,704 INFO  Zx8xQOXO-[y4abf65tag,smljsd5o40,d06xori0ot] Stopping StubHostImpl{id=d06xori0ot} in [LocalhostMachineProvisioningLocation{id=lzocjyjw1g, name=localhost}, SshMachineLocation[localhost:null@764b3d68a4e5/172.17.0.2:22(id=cg4t8t3stw)]]
2018-12-10 17:35:15,707 INFO  rad9Kv6f-[toptt1oeyo,uotltoonab,v8zdcluxqm] Stopping StubHostImpl{id=v8zdcluxqm} in [LocalhostMachineProvisioningLocation{id=lzocjyjw1g, name=localhost}, SshMachineLocation[localhost:null@764b3d68a4e5/172.17.0.2:22(id=xhris6mjwa)]]
2018-12-10 17:35:15,713 INFO  vuMiy4NE-[nui4dq6ev3] Stopping application StubInfrastructureImpl{id=nui4dq6ev3}
2018-12-10 17:35:15,714 INFO  TdcauPL1-[elc9tv4eup] Stopping application StubInfrastructureImpl{id=elc9tv4eup}
2018-12-10 17:35:15,715 INFO  aYUVj1eF-[az75yslxys] Stopping application StubInfrastructureImpl{id=az75yslxys}
2018-12-10 17:35:15,718 INFO  wHxDfRhA-[elc9tv4eup,j1cet10onc,gv3q1dkia8] Stopping StubHostImpl{id=gv3q1dkia8} in [LocalhostMachineProvisioningLocation{id=lzocjyjw1g, name=localhost}]
2018-12-10 17:35:15,719 INFO  p3yDkD9K-[nui4dq6ev3,oy3duq7745,kj5gm2n4es] Stopping StubHostImpl{id=kj5gm2n4es} in [LocalhostMachineProvisioningLocation{id=lzocjyjw1g, name=localhost}]
2018-12-10 17:35:15,719 INFO  BciwUgh0-[kh3h8eon8z] Stopping application StubInfrastructureImpl{id=kh3h8eon8z}
2018-12-10 17:35:15,720 INFO  zN7Gz67N-[y4abf65tag] Stopping application StubInfrastructureImpl{id=y4abf65tag}
2018-12-10 17:35:15,721 INFO  rJcQmEjx-[az75yslxys,s5e6jn7un5,urjrqu4vdg] Stopping StubHostImpl{id=urjrqu4vdg} in [LocalhostMachineProvisioningLocation{id=lzocjyjw1g, name=localhost}]
2018-12-10 17:35:15,722 INFO  BamKeDDM-[kh3h8eon8z,anly8uo53j,dz8dfepdft] Stopping StubHostImpl{id=dz8dfepdft} in [LocalhostMachineProvisioningLocation{id=lzocjyjw1g, name=localhost}]
2018-12-10 17:35:15,725 INFO  k9YQrxPa-[toptt1oeyo] Stopping application StubInfrastructureImpl{id=toptt1oeyo}
2018-12-10 17:35:15,726 INFO  wpIItlKW-[sx7cywhd60] Stopping application StubInfrastructureImpl{id=sx7cywhd60}
2018-12-10 17:35:15,728 INFO  cqmv7ty2-[vum20jwdx7] Stopping application StubInfrastructureImpl{id=vum20jwdx7}
2018-12-10 17:35:15,729 INFO  y8U9d4Bp-[wvalq7d4ak] Stopping application StubInfrastructureImpl{id=wvalq7d4ak}
2018-12-10 17:35:15,730 INFO  TdcauPL1-[elc9tv4eup] Stopped application StubInfrastructureImpl{id=elc9tv4eup}
2018-12-10 17:35:15,731 INFO  BciwUgh0-[kh3h8eon8z] Stopped application StubInfrastructureImpl{id=kh3h8eon8z}
2018-12-10 17:35:15,731 INFO  TVRIRmwa-[y4abf65tag,smljsd5o40,d06xori0ot] Stopping StubHostImpl{id=d06xori0ot} in [LocalhostMachineProvisioningLocation{id=lzocjyjw1g, name=localhost}]
2018-12-10 17:35:15,731 INFO  n0bIXnQW-[lt1gu4c4gy] Stopping application StubInfrastructureImpl{id=lt1gu4c4gy}
2018-12-10 17:35:15,732 INFO  vuMiy4NE-[nui4dq6ev3] Stopped application StubInfrastructureImpl{id=nui4dq6ev3}
2018-12-10 17:35:15,735 INFO  aYUVj1eF-[az75yslxys] Stopped application StubInfrastructureImpl{id=az75yslxys}
2018-12-10 17:35:15,735 INFO  AhDBeIdr-[sx7cywhd60,k7u9flt9am,pos78sk1kv] Stopping StubHostImpl{id=pos78sk1kv} in [LocalhostMachineProvisioningLocation{id=lzocjyjw1g, name=localhost}]
2018-12-10 17:35:15,735 INFO  o2NdOVk1-[wvalq7d4ak,sai2cjyww5,fuwrl6djc6] Stopping StubHostImpl{id=fuwrl6djc6} in [LocalhostMachineProvisioningLocation{id=lzocjyjw1g, name=localhost}]
2018-12-10 17:35:15,736 INFO  nMF5dGY1-[toptt1oeyo,uotltoonab,v8zdcluxqm] Stopping StubHostImpl{id=v8zdcluxqm} in [LocalhostMachineProvisioningLocation{id=lzocjyjw1g, name=localhost}]
2018-12-10 17:35:15,738 INFO  f0x03OQU-[lt1gu4c4gy,t0vztaf1pk,pmdaa46k8p] Stopping StubHostImpl{id=pmdaa46k8p} in [LocalhostMachineProvisioningLocation{id=lzocjyjw1g, name=localhost}]
2018-12-10 17:35:15,745 INFO  zN7Gz67N-[y4abf65tag] Stopped application StubInfrastructureImpl{id=y4abf65tag}
2018-12-10 17:35:15,745 INFO  F3JSZawy-[vum20jwdx7,p16o377ywq,nq8th6ui8v] Stopping StubHostImpl{id=nq8th6ui8v} in [LocalhostMachineProvisioningLocation{id=lzocjyjw1g, name=localhost}]
2018-12-10 17:35:15,750 INFO  y8U9d4Bp-[wvalq7d4ak] Stopped application StubInfrastructureImpl{id=wvalq7d4ak}
2018-12-10 17:35:15,756 INFO  k9YQrxPa-[toptt1oeyo] Stopped application StubInfrastructureImpl{id=toptt1oeyo}
2018-12-10 17:35:15,757 INFO  wpIItlKW-[sx7cywhd60] Stopped application StubInfrastructureImpl{id=sx7cywhd60}
2018-12-10 17:35:15,762 INFO  n0bIXnQW-[lt1gu4c4gy] Stopped application StubInfrastructureImpl{id=lt1gu4c4gy}
2018-12-10 17:35:15,762 INFO  cqmv7ty2-[vum20jwdx7] Stopped application StubInfrastructureImpl{id=vum20jwdx7}
2018-12-10 17:35:21,337 INFO  - TESTNG PASSED CONFIGURATION: "Surefire test" - @AfterMethod org.apache.brooklyn.core.mgmt.rebind.RebindTestFixture.tearDown() finished in 5814 ms
2018-12-10 17:35:21,416 INFO  - TESTNG 
===============================================
    Surefire test
    Tests run: 234, Failures: 1, Skips: 0
===============================================
[GC (Allocation Failure)  263790K->75053K(750080K), 0.0272333 secs]
Tests run: 234, Failures: 1, Errors: 0, Skipped: 0, Time elapsed: 102.191 sec <<< FAILURE! - in TestSuite
testStopDuringProvisionWaitsForCompletion(org.apache.brooklyn.entity.software.base.SoftwareProcessStopsDuringStartTest)  Time elapsed: 0.186 sec  <<< FAILURE!
java.lang.AssertionError: lists don't have the same size expected [2] but found [1]
	at org.apache.brooklyn.entity.software.base.SoftwareProcessStopsDuringStartTest.testStopDuringProvisionWaitsForCompletion(SoftwareProcessStopsDuringStartTest.java:184)


Results :

Failed tests: 
  SoftwareProcessStopsDuringStartTest.testStopDuringProvisionWaitsForCompletion:184 lists don't have the same size expected [2] but found [1]

Tests run: 234, Failures: 1, Errors: 0, Skipped: 0

[INFO] ------------------------------------------------------------------------
[INFO] Reactor Summary:
[INFO] 
[INFO] Brooklyn Server Root ............................... SUCCESS [  4.397 s]
[INFO] Brooklyn Parent Project ............................ SUCCESS [  5.244 s]
[INFO] Brooklyn Test Support Utilities .................... SUCCESS [  8.332 s]
[INFO] Brooklyn Logback Includable Configuration .......... SUCCESS [  0.437 s]
[INFO] Brooklyn Common Utilities .......................... SUCCESS [ 29.207 s]
[INFO] Brooklyn API ....................................... SUCCESS [  3.509 s]
[INFO] CAMP Server Parent Project ......................... SUCCESS [  0.119 s]
[INFO] CAMP Base .......................................... SUCCESS [  3.726 s]
[INFO] Brooklyn Test Support .............................. SUCCESS [  2.414 s]
[INFO] Brooklyn REST Swagger Apidoc Utilities ............. SUCCESS [ 14.125 s]
[INFO] Brooklyn Logback Configuration ..................... SUCCESS [  0.210 s]
[INFO] CAMP Server ........................................ SUCCESS [ 13.784 s]
[INFO] Brooklyn Felix Runtime ............................. SUCCESS [  3.447 s]
[INFO] Brooklyn Groovy Utilities .......................... SUCCESS [  2.155 s]
[INFO] Brooklyn Core ...................................... SUCCESS [04:23 min]
[INFO] Brooklyn Policies .................................. SUCCESS [ 34.091 s]
[INFO] Brooklyn WinRM Software Entities ................... SUCCESS [ 20.950 s]
[INFO] Brooklyn Secure JMXMP Agent ........................ SUCCESS [  8.113 s]
[INFO] Brooklyn JMX RMI Agent ............................. SUCCESS [  0.394 s]
[INFO] Brooklyn Jclouds Location Targets .................. SUCCESS [01:05 min]
[INFO] Brooklyn Software Base ............................. FAILURE [01:50 min]
[INFO] Brooklyn CAMP ...................................... SKIPPED
[INFO] Brooklyn Launcher Common ........................... SKIPPED
[INFO] Brooklyn REST API .................................. SKIPPED
[INFO] Brooklyn REST Resources ............................ SKIPPED
[INFO] Brooklyn REST Server ............................... SKIPPED
[INFO] Brooklyn Launcher .................................. SKIPPED
[INFO] Brooklyn Container Location Targets ................ SKIPPED
[INFO] Brooklyn Command Line Interface .................... SKIPPED
[INFO] Brooklyn Test Framework ............................ SKIPPED
[INFO] Brooklyn OSGi init ................................. SKIPPED
[INFO] Brooklyn OSGi start ................................ SKIPPED
[INFO] Brooklyn Karaf ..................................... SKIPPED
[INFO] Jetty config fragment .............................. SKIPPED
[INFO] Apache Http Component extension .................... SKIPPED
[INFO] Brooklyn Karaf Features ............................ SKIPPED
[INFO] Brooklyn Karaf Shell Commands ...................... SKIPPED
[INFO] Brooklyn UI :: Parent .............................. SKIPPED
[INFO] Brooklyn UI :: Modularity Server (parent) .......... SKIPPED
[INFO] Brooklyn UI :: Modularity Server :: UI Module API .. SKIPPED
[INFO] Brooklyn UI :: Modularity Server :: UI Module Registry SKIPPED
[INFO] Brooklyn UI :: Modularity Server :: UI Proxy ....... SKIPPED
[INFO] Brooklyn UI :: Modularity Server :: UI Metadata Registry SKIPPED
[INFO] Brooklyn UI :: Modularity Server :: External UI Modules Registration Hooks SKIPPED
[INFO] Brooklyn UI :: Modularity Server :: Features ....... SKIPPED
[INFO] Brooklyn UI :: Modules (parent) .................... SKIPPED
[INFO] Brooklyn UI :: Modules - UI Utils .................. SKIPPED
[INFO] Brooklyn UI :: Modules - Home ...................... SKIPPED
[INFO] Brooklyn UI :: Modules - App inspector ............. SKIPPED
[INFO] Brooklyn UI :: Modules - Blueprint composer ........ SKIPPED
[INFO] Brooklyn UI :: Modules - Blueprint importer ........ SKIPPED
[INFO] Brooklyn UI :: Modules - Catalog ................... SKIPPED
[INFO] Brooklyn UI :: Modules - Location manager .......... SKIPPED
[INFO] Brooklyn UI :: Modules - REST API Docs ............. SKIPPED
[INFO] Brooklyn UI :: Modules - Groovy console ............ SKIPPED
[INFO] Brooklyn UI :: Modules - Logout .................... SKIPPED
[INFO] Brooklyn UI :: Modules - Features .................. SKIPPED
[INFO] Brooklyn UI :: Features ............................ SKIPPED
[INFO] Brooklyn Library Root .............................. SKIPPED
[INFO] Brooklyn CM Chef ................................... SKIPPED
[INFO] Brooklyn CM SaltStack .............................. SKIPPED
[INFO] Brooklyn CM Ansible ................................ SKIPPED
[INFO] Brooklyn CM Integration Root ....................... SKIPPED
[INFO] Brooklyn Network Software Entities ................. SKIPPED
[INFO] Brooklyn OSGi Software Entities .................... SKIPPED
[INFO] Brooklyn Database Software Entities ................ SKIPPED
[INFO] Brooklyn Web App Software Entities ................. SKIPPED
[INFO] Brooklyn Messaging Software Entities ............... SKIPPED
[INFO] Brooklyn NoSQL Data Store Software Entities ........ SKIPPED
[INFO] Brooklyn Monitoring Software Entities .............. SKIPPED
[INFO] Brooklyn Web App Software Entities ................. SKIPPED
[INFO] Brooklyn QA ........................................ SKIPPED
[INFO] Brooklyn Examples Aggregator Project ............... SKIPPED
[INFO] Brooklyn Examples Aggregator Project - Webapps ..... SKIPPED
[INFO] hello-world-webapp Maven Webapp .................... SKIPPED
[INFO] hello-world-sql-webapp Maven Webapp ................ SKIPPED
[INFO] Brooklyn Simple Web Cluster Example ................ SKIPPED
[INFO] Brooklyn Library Karaf integration ................. SKIPPED
[INFO] Brooklyn Library Catalog ........................... SKIPPED
[INFO] Brooklyn Library Karaf Features .................... SKIPPED
[INFO] Brooklyn Client .................................... SKIPPED
[INFO] Brooklyn Client Command Line Interface ............. SKIPPED
[INFO] Brooklyn REST java Client .......................... SKIPPED
[INFO] Brooklyn Downstream Project Parent ................. SKIPPED
[INFO] Brooklyn Dist Root ................................. SKIPPED
[INFO] Brooklyn All Things ................................ SKIPPED
[INFO] Brooklyn Distribution .............................. SKIPPED
[INFO] Brooklyn Karaf Distribution Parent ................. SKIPPED
[INFO] Brooklyn Karaf Server Configuration ................ SKIPPED
[INFO] Brooklyn Dist Karaf Features ....................... SKIPPED
[INFO] Brooklyn Karaf Distribution ........................ SKIPPED
[INFO] Brooklyn Karaf pax-exam itest ...................... SKIPPED
[INFO] Brooklyn Vagrant Getting Started Environment ....... SKIPPED
[INFO] Brooklyn Quick-Start Project Archetype ............. SKIPPED
[INFO] Brooklyn Shared Package Files ...................... SKIPPED
[INFO] Brooklyn RPM Package ............................... SKIPPED
[INFO] Brooklyn DEB Package ............................... SKIPPED
[INFO] Brooklyn Root 1.0.0-SNAPSHOT ....................... SKIPPED
[INFO] ------------------------------------------------------------------------
[INFO] BUILD FAILURE
[INFO] ------------------------------------------------------------------------
[INFO] Total time: 10:16 min
[INFO] Finished at: 2018-12-10T17:35:22Z
[INFO] ------------------------------------------------------------------------
[ERROR] Failed to execute goal org.apache.maven.plugins:maven-surefire-plugin:2.19.1:test (default-test) on project brooklyn-software-base: There are test failures.
[ERROR] 
[ERROR] Please refer to /usr/build/brooklyn-server/software/base/target/surefire-reports for the individual test results.
[ERROR] -> [Help 1]
[ERROR] 
[ERROR] To see the full stack trace of the errors, re-run Maven with the -e switch.
[ERROR] Re-run Maven using the -X switch to enable full debug logging.
[ERROR] 
[ERROR] For more information about the errors and possible solutions, please read the following articles:
[ERROR] [Help 1] http://cwiki.apache.org/confluence/display/MAVEN/MojoFailureException
[ERROR] 
[ERROR] After correcting the problems, you can resume the build with the command
[ERROR]   mvn <goals> -rf :brooklyn-software-base
Build step 'Execute shell' marked build as failure
Recording test results
TestNG Reports Processing: START
Looking for TestNG results report in workspace using pattern: **/testng-results.xml
Saving reports...
Processing '/x1/jenkins/jenkins-home/jobs/brooklyn-master-build-docker/builds/1132/testng/testng-results-1.xml'
Processing '/x1/jenkins/jenkins-home/jobs/brooklyn-master-build-docker/builds/1132/testng/testng-results-10.xml'
Processing '/x1/jenkins/jenkins-home/jobs/brooklyn-master-build-docker/builds/1132/testng/testng-results-11.xml'
Processing '/x1/jenkins/jenkins-home/jobs/brooklyn-master-build-docker/builds/1132/testng/testng-results-2.xml'
Processing '/x1/jenkins/jenkins-home/jobs/brooklyn-master-build-docker/builds/1132/testng/testng-results-3.xml'
Processing '/x1/jenkins/jenkins-home/jobs/brooklyn-master-build-docker/builds/1132/testng/testng-results-4.xml'
Processing '/x1/jenkins/jenkins-home/jobs/brooklyn-master-build-docker/builds/1132/testng/testng-results-5.xml'
Processing '/x1/jenkins/jenkins-home/jobs/brooklyn-master-build-docker/builds/1132/testng/testng-results-6.xml'
Processing '/x1/jenkins/jenkins-home/jobs/brooklyn-master-build-docker/builds/1132/testng/testng-results-7.xml'
Processing '/x1/jenkins/jenkins-home/jobs/brooklyn-master-build-docker/builds/1132/testng/testng-results-8.xml'
Processing '/x1/jenkins/jenkins-home/jobs/brooklyn-master-build-docker/builds/1132/testng/testng-results-9.xml'
Processing '/x1/jenkins/jenkins-home/jobs/brooklyn-master-build-docker/builds/1132/testng/testng-results.xml'
0.028185% of tests failed, which exceeded threshold of 0%. Marking build as UNSTABLE
TestNG Reports Processing: FINISH