git.net

[Date Prev][Date Next][Thread Prev][Thread Next][Date Index][Thread Index]

Build failed in Jenkins: brooklyn-master-build-docker #1115


See <https://builds.apache.org/job/brooklyn-master-build-docker/1115/display/redirect>

------------------------------------------
[...truncated 6.18 MB...]
2018-12-07 06:49:05,280 INFO  - TESTNG PASSED CONFIGURATION: "Surefire test" - @AfterMethod org.apache.brooklyn.core.mgmt.rebind.RebindTestFixture.tearDown() finished in 11 ms
2018-12-07 06:49:05,281 INFO  - TESTNG INVOKING CONFIGURATION: "Surefire test" - @BeforeMethod org.apache.brooklyn.core.test.BrooklynAppUnitTestSupport.setUp()
2018-12-07 06:49:05,281 INFO  - Added external config supplier named 'brooklyn-demo-sample': org.apache.brooklyn.core.config.external.InPlaceExternalConfigSupplier@117c4ae0
2018-12-07 06:49:05,292 INFO  - TESTNG PASSED CONFIGURATION: "Surefire test" - @BeforeMethod org.apache.brooklyn.core.test.BrooklynAppUnitTestSupport.setUp() finished in 12 ms
2018-12-07 06:49:05,292 INFO  - TESTNG INVOKING CONFIGURATION: "Surefire test" - @BeforeMethod org.apache.brooklyn.core.sensor.password.CreatePasswordSensorTest.setup()
2018-12-07 06:49:05,322 INFO  - TESTNG PASSED CONFIGURATION: "Surefire test" - @BeforeMethod org.apache.brooklyn.core.sensor.password.CreatePasswordSensorTest.setup() finished in 30 ms
2018-12-07 06:49:05,322 INFO  - TESTNG INVOKING: "Surefire test" - org.apache.brooklyn.core.sensor.password.CreatePasswordSensorTest.testCreatePasswordCharacterGroups()
2018-12-07 06:49:05,327 INFO  - TESTNG PASSED: "Surefire test" - org.apache.brooklyn.core.sensor.password.CreatePasswordSensorTest.testCreatePasswordCharacterGroups() finished in 5 ms
2018-12-07 06:49:05,327 INFO  - TESTNG INVOKING CONFIGURATION: "Surefire test" - @AfterMethod org.apache.brooklyn.core.test.BrooklynMgmtUnitTestSupport.tearDown()
2018-12-07 06:49:05,332 INFO  - TESTNG PASSED CONFIGURATION: "Surefire test" - @AfterMethod org.apache.brooklyn.core.test.BrooklynMgmtUnitTestSupport.tearDown() finished in 4 ms
2018-12-07 06:49:05,332 INFO  - TESTNG INVOKING CONFIGURATION: "Surefire test" - @BeforeMethod org.apache.brooklyn.core.test.BrooklynAppUnitTestSupport.setUp()
2018-12-07 06:49:05,332 INFO  - Added external config supplier named 'brooklyn-demo-sample': org.apache.brooklyn.core.config.external.InPlaceExternalConfigSupplier@3c617ef6
2018-12-07 06:49:05,343 INFO  - TESTNG PASSED CONFIGURATION: "Surefire test" - @BeforeMethod org.apache.brooklyn.core.test.BrooklynAppUnitTestSupport.setUp() finished in 11 ms
2018-12-07 06:49:05,343 INFO  - TESTNG INVOKING CONFIGURATION: "Surefire test" - @BeforeMethod org.apache.brooklyn.core.sensor.password.CreatePasswordSensorTest.setup()
2018-12-07 06:49:05,372 INFO  - TESTNG PASSED CONFIGURATION: "Surefire test" - @BeforeMethod org.apache.brooklyn.core.sensor.password.CreatePasswordSensorTest.setup() finished in 29 ms
2018-12-07 06:49:05,372 INFO  - TESTNG INVOKING: "Surefire test" - org.apache.brooklyn.core.sensor.password.CreatePasswordSensorTest.testCreatePasswordCreatesAPasswordOfDefaultLength()
2018-12-07 06:49:05,373 INFO  - TESTNG PASSED: "Surefire test" - org.apache.brooklyn.core.sensor.password.CreatePasswordSensorTest.testCreatePasswordCreatesAPasswordOfDefaultLength() finished in 1 ms
2018-12-07 06:49:05,373 INFO  - TESTNG INVOKING CONFIGURATION: "Surefire test" - @AfterMethod org.apache.brooklyn.core.test.BrooklynMgmtUnitTestSupport.tearDown()
2018-12-07 06:49:05,377 INFO  - TESTNG PASSED CONFIGURATION: "Surefire test" - @AfterMethod org.apache.brooklyn.core.test.BrooklynMgmtUnitTestSupport.tearDown() finished in 4 ms
2018-12-07 06:49:05,377 INFO  - TESTNG INVOKING CONFIGURATION: "Surefire test" - @BeforeMethod org.apache.brooklyn.core.test.BrooklynAppUnitTestSupport.setUp()
2018-12-07 06:49:05,378 INFO  - Added external config supplier named 'brooklyn-demo-sample': org.apache.brooklyn.core.config.external.InPlaceExternalConfigSupplier@182e516d
2018-12-07 06:49:05,388 INFO  - TESTNG PASSED CONFIGURATION: "Surefire test" - @BeforeMethod org.apache.brooklyn.core.test.BrooklynAppUnitTestSupport.setUp() finished in 11 ms
2018-12-07 06:49:05,389 INFO  - TESTNG INVOKING: "Surefire test" - org.apache.brooklyn.core.sensor.DurationSinceSensorTest.testSensorAddedAndUpdated()
2018-12-07 06:49:05,466 INFO  - TESTNG PASSED: "Surefire test" - org.apache.brooklyn.core.sensor.DurationSinceSensorTest.testSensorAddedAndUpdated() finished in 77 ms
2018-12-07 06:49:05,466 INFO  - TESTNG INVOKING CONFIGURATION: "Surefire test" - @AfterMethod org.apache.brooklyn.core.test.BrooklynMgmtUnitTestSupport.tearDown()
2018-12-07 06:49:05,472 INFO  - TESTNG PASSED CONFIGURATION: "Surefire test" - @AfterMethod org.apache.brooklyn.core.test.BrooklynMgmtUnitTestSupport.tearDown() finished in 6 ms
2018-12-07 06:49:05,472 INFO  - TESTNG INVOKING CONFIGURATION: "Surefire test" - @BeforeMethod org.apache.brooklyn.core.sensor.http.HttpRequestSensorTest.setUp()
2018-12-07 06:49:05,475 INFO  - Added external config supplier named 'brooklyn-demo-sample': org.apache.brooklyn.core.config.external.InPlaceExternalConfigSupplier@76da4a8d
[GC (Allocation Failure)  403215K->180856K(766464K), 0.0441423 secs]
2018-12-07 06:49:05,566 INFO  - TESTNG PASSED CONFIGURATION: "Surefire test" - @BeforeMethod org.apache.brooklyn.core.sensor.http.HttpRequestSensorTest.setUp() finished in 94 ms
2018-12-07 06:49:05,566 INFO  - TESTNG INVOKING: "Surefire test" - org.apache.brooklyn.core.sensor.http.HttpRequestSensorTest.testDoNotParseJson()
2018-12-07 06:49:05,611 INFO  - TESTNG PASSED: "Surefire test" - org.apache.brooklyn.core.sensor.http.HttpRequestSensorTest.testDoNotParseJson() finished in 45 ms
2018-12-07 06:49:05,611 INFO  - TESTNG INVOKING CONFIGURATION: "Surefire test" - @AfterMethod org.apache.brooklyn.core.sensor.http.HttpRequestSensorTest.tearDown()
2018-12-07 06:49:05,617 INFO  - TESTNG PASSED CONFIGURATION: "Surefire test" - @AfterMethod org.apache.brooklyn.core.sensor.http.HttpRequestSensorTest.tearDown() finished in 6 ms
2018-12-07 06:49:05,617 INFO  - TESTNG INVOKING CONFIGURATION: "Surefire test" - @BeforeMethod org.apache.brooklyn.core.sensor.http.HttpRequestSensorTest.setUp()
2018-12-07 06:49:05,619 INFO  - Added external config supplier named 'brooklyn-demo-sample': org.apache.brooklyn.core.config.external.InPlaceExternalConfigSupplier@39e01ad4
2018-12-07 06:49:05,672 INFO  - TESTNG PASSED CONFIGURATION: "Surefire test" - @BeforeMethod org.apache.brooklyn.core.sensor.http.HttpRequestSensorTest.setUp() finished in 55 ms
2018-12-07 06:49:05,673 INFO  - TESTNG INVOKING: "Surefire test" - org.apache.brooklyn.core.sensor.http.HttpRequestSensorTest.testHttpSensor()
2018-12-07 06:49:05,681 INFO  - TESTNG PASSED: "Surefire test" - org.apache.brooklyn.core.sensor.http.HttpRequestSensorTest.testHttpSensor() finished in 9 ms
2018-12-07 06:49:05,682 INFO  - TESTNG INVOKING CONFIGURATION: "Surefire test" - @AfterMethod org.apache.brooklyn.core.sensor.http.HttpRequestSensorTest.tearDown()
2018-12-07 06:49:05,687 INFO  - TESTNG PASSED CONFIGURATION: "Surefire test" - @AfterMethod org.apache.brooklyn.core.sensor.http.HttpRequestSensorTest.tearDown() finished in 6 ms
2018-12-07 06:49:05,688 INFO  - TESTNG INVOKING CONFIGURATION: "Surefire test" - @BeforeMethod org.apache.brooklyn.core.sensor.http.HttpRequestSensorTest.setUp()
2018-12-07 06:49:05,689 INFO  - Added external config supplier named 'brooklyn-demo-sample': org.apache.brooklyn.core.config.external.InPlaceExternalConfigSupplier@44937a33
2018-12-07 06:49:05,729 INFO  - TESTNG PASSED CONFIGURATION: "Surefire test" - @BeforeMethod org.apache.brooklyn.core.sensor.http.HttpRequestSensorTest.setUp() finished in 41 ms
2018-12-07 06:49:05,729 INFO  - TESTNG INVOKING: "Surefire test" - org.apache.brooklyn.core.sensor.http.HttpRequestSensorTest.testNonJson()
2018-12-07 06:49:05,737 INFO  - TESTNG PASSED: "Surefire test" - org.apache.brooklyn.core.sensor.http.HttpRequestSensorTest.testNonJson() finished in 8 ms
2018-12-07 06:49:05,737 INFO  - TESTNG INVOKING CONFIGURATION: "Surefire test" - @AfterMethod org.apache.brooklyn.core.sensor.http.HttpRequestSensorTest.tearDown()
2018-12-07 06:49:05,742 INFO  - TESTNG PASSED CONFIGURATION: "Surefire test" - @AfterMethod org.apache.brooklyn.core.sensor.http.HttpRequestSensorTest.tearDown() finished in 4 ms
2018-12-07 06:49:05,742 INFO  - TESTNG INVOKING CONFIGURATION: "Surefire test" - @BeforeMethod org.apache.brooklyn.core.sensor.http.HttpRequestSensorTest.setUp()
2018-12-07 06:49:05,743 INFO  - Added external config supplier named 'brooklyn-demo-sample': org.apache.brooklyn.core.config.external.InPlaceExternalConfigSupplier@6980d139
2018-12-07 06:49:05,785 INFO  - TESTNG PASSED CONFIGURATION: "Surefire test" - @BeforeMethod org.apache.brooklyn.core.sensor.http.HttpRequestSensorTest.setUp() finished in 43 ms
2018-12-07 06:49:05,785 INFO  - TESTNG INVOKING: "Surefire test" - org.apache.brooklyn.core.sensor.http.HttpRequestSensorTest.testPreemptiveBasicAuth()
2018-12-07 06:49:05,794 INFO  - TESTNG PASSED: "Surefire test" - org.apache.brooklyn.core.sensor.http.HttpRequestSensorTest.testPreemptiveBasicAuth() finished in 9 ms
2018-12-07 06:49:05,794 INFO  - TESTNG INVOKING CONFIGURATION: "Surefire test" - @AfterMethod org.apache.brooklyn.core.sensor.http.HttpRequestSensorTest.tearDown()
2018-12-07 06:49:05,799 INFO  - TESTNG PASSED CONFIGURATION: "Surefire test" - @AfterMethod org.apache.brooklyn.core.sensor.http.HttpRequestSensorTest.tearDown() finished in 5 ms
2018-12-07 06:49:05,799 INFO  - TESTNG INVOKING CONFIGURATION: "Surefire test" - @BeforeMethod org.apache.brooklyn.core.test.BrooklynAppUnitTestSupport.setUp()
2018-12-07 06:49:05,800 INFO  - Added external config supplier named 'brooklyn-demo-sample': org.apache.brooklyn.core.config.external.InPlaceExternalConfigSupplier@639c1437
2018-12-07 06:49:05,811 INFO  - TESTNG PASSED CONFIGURATION: "Surefire test" - @BeforeMethod org.apache.brooklyn.core.test.BrooklynAppUnitTestSupport.setUp() finished in 12 ms
2018-12-07 06:49:05,811 INFO  - TESTNG INVOKING: "Surefire test" - org.apache.brooklyn.core.sensor.MaxConcurrencySensorTest.testAddsStaticSensorOfTypeString()
2018-12-07 06:49:05,826 INFO  - TESTNG PASSED: "Surefire test" - org.apache.brooklyn.core.sensor.MaxConcurrencySensorTest.testAddsStaticSensorOfTypeString() finished in 15 ms
2018-12-07 06:49:05,826 INFO  - TESTNG INVOKING CONFIGURATION: "Surefire test" - @AfterMethod org.apache.brooklyn.core.test.BrooklynMgmtUnitTestSupport.tearDown()
2018-12-07 06:49:05,830 INFO  - TESTNG PASSED CONFIGURATION: "Surefire test" - @AfterMethod org.apache.brooklyn.core.test.BrooklynMgmtUnitTestSupport.tearDown() finished in 3 ms
2018-12-07 06:49:05,830 INFO  - TESTNG INVOKING CONFIGURATION: "Surefire test" - @BeforeMethod org.apache.brooklyn.core.test.BrooklynAppUnitTestSupport.setUp()
2018-12-07 06:49:05,830 INFO  - Added external config supplier named 'brooklyn-demo-sample': org.apache.brooklyn.core.config.external.InPlaceExternalConfigSupplier@276c5f00
2018-12-07 06:49:05,841 INFO  - TESTNG PASSED CONFIGURATION: "Surefire test" - @BeforeMethod org.apache.brooklyn.core.test.BrooklynAppUnitTestSupport.setUp() finished in 11 ms
2018-12-07 06:49:05,842 INFO  - TESTNG INVOKING: "Surefire test" - org.apache.brooklyn.core.sensor.SensorEventPredicatesTest.testSensorEqualTo()
2018-12-07 06:49:05,843 INFO  - TESTNG PASSED: "Surefire test" - org.apache.brooklyn.core.sensor.SensorEventPredicatesTest.testSensorEqualTo() finished in 1 ms
2018-12-07 06:49:05,843 INFO  - TESTNG INVOKING CONFIGURATION: "Surefire test" - @AfterMethod org.apache.brooklyn.core.test.BrooklynMgmtUnitTestSupport.tearDown()
2018-12-07 06:49:05,847 INFO  - TESTNG PASSED CONFIGURATION: "Surefire test" - @AfterMethod org.apache.brooklyn.core.test.BrooklynMgmtUnitTestSupport.tearDown() finished in 4 ms
2018-12-07 06:49:05,848 INFO  - TESTNG INVOKING CONFIGURATION: "Surefire test" - @BeforeMethod org.apache.brooklyn.core.test.BrooklynAppUnitTestSupport.setUp()
2018-12-07 06:49:05,848 INFO  - Added external config supplier named 'brooklyn-demo-sample': org.apache.brooklyn.core.config.external.InPlaceExternalConfigSupplier@5f8bedda
2018-12-07 06:49:05,863 INFO  - TESTNG PASSED CONFIGURATION: "Surefire test" - @BeforeMethod org.apache.brooklyn.core.test.BrooklynAppUnitTestSupport.setUp() finished in 15 ms
2018-12-07 06:49:05,863 INFO  - TESTNG INVOKING: "Surefire test" - org.apache.brooklyn.core.sensor.SensorEventPredicatesTest.testSensorSatisfies()
2018-12-07 06:49:05,863 INFO  - TESTNG PASSED: "Surefire test" - org.apache.brooklyn.core.sensor.SensorEventPredicatesTest.testSensorSatisfies() finished in 0 ms
2018-12-07 06:49:05,863 INFO  - TESTNG INVOKING CONFIGURATION: "Surefire test" - @AfterMethod org.apache.brooklyn.core.test.BrooklynMgmtUnitTestSupport.tearDown()
2018-12-07 06:49:05,869 INFO  - TESTNG PASSED CONFIGURATION: "Surefire test" - @AfterMethod org.apache.brooklyn.core.test.BrooklynMgmtUnitTestSupport.tearDown() finished in 6 ms
2018-12-07 06:49:05,869 INFO  - TESTNG INVOKING CONFIGURATION: "Surefire test" - @BeforeMethod org.apache.brooklyn.core.test.BrooklynAppUnitTestSupport.setUp()
2018-12-07 06:49:05,869 INFO  - Added external config supplier named 'brooklyn-demo-sample': org.apache.brooklyn.core.config.external.InPlaceExternalConfigSupplier@46abc96f
2018-12-07 06:49:05,883 INFO  - TESTNG PASSED CONFIGURATION: "Surefire test" - @BeforeMethod org.apache.brooklyn.core.test.BrooklynAppUnitTestSupport.setUp() finished in 14 ms
2018-12-07 06:49:05,883 INFO  - TESTNG INVOKING: "Surefire test" - org.apache.brooklyn.core.sensor.SensorEventPredicatesTest.testValueEqualTo()
2018-12-07 06:49:05,884 INFO  - TESTNG PASSED: "Surefire test" - org.apache.brooklyn.core.sensor.SensorEventPredicatesTest.testValueEqualTo() finished in 1 ms
2018-12-07 06:49:05,884 INFO  - TESTNG INVOKING CONFIGURATION: "Surefire test" - @AfterMethod org.apache.brooklyn.core.test.BrooklynMgmtUnitTestSupport.tearDown()
2018-12-07 06:49:05,889 INFO  - TESTNG PASSED CONFIGURATION: "Surefire test" - @AfterMethod org.apache.brooklyn.core.test.BrooklynMgmtUnitTestSupport.tearDown() finished in 4 ms
2018-12-07 06:49:05,889 INFO  - TESTNG INVOKING CONFIGURATION: "Surefire test" - @BeforeMethod org.apache.brooklyn.core.test.BrooklynAppUnitTestSupport.setUp()
2018-12-07 06:49:05,889 INFO  - Added external config supplier named 'brooklyn-demo-sample': org.apache.brooklyn.core.config.external.InPlaceExternalConfigSupplier@186ee1a3
2018-12-07 06:49:05,902 INFO  - TESTNG PASSED CONFIGURATION: "Surefire test" - @BeforeMethod org.apache.brooklyn.core.test.BrooklynAppUnitTestSupport.setUp() finished in 13 ms
2018-12-07 06:49:05,902 INFO  - TESTNG INVOKING: "Surefire test" - org.apache.brooklyn.core.sensor.SensorEventPredicatesTest.testValueSatisfies()
2018-12-07 06:49:05,902 INFO  - TESTNG PASSED: "Surefire test" - org.apache.brooklyn.core.sensor.SensorEventPredicatesTest.testValueSatisfies() finished in 0 ms
2018-12-07 06:49:05,902 INFO  - TESTNG INVOKING CONFIGURATION: "Surefire test" - @AfterMethod org.apache.brooklyn.core.test.BrooklynMgmtUnitTestSupport.tearDown()
2018-12-07 06:49:05,906 INFO  - TESTNG PASSED CONFIGURATION: "Surefire test" - @AfterMethod org.apache.brooklyn.core.test.BrooklynMgmtUnitTestSupport.tearDown() finished in 4 ms
2018-12-07 06:49:06,150 INFO  - TESTNG 
===============================================
    Surefire test
    Tests run: 2348, Failures: 1, Skips: 0
===============================================
[GC (Allocation Failure)  404088K->179644K(768512K), 0.0185538 secs]
[GC (Allocation Failure)  405436K->178032K(768000K), 0.0226148 secs]
[GC (Allocation Failure)  403824K->178112K(768000K), 0.0141921 secs]
[GC (Allocation Failure)  403392K->178120K(768000K), 0.0080775 secs]
[GC (Allocation Failure)  403400K->178288K(768512K), 0.0208160 secs]
[GC (Allocation Failure)  404592K->179563K(768512K), 0.0068796 secs]
Tests run: 2348, Failures: 1, Errors: 0, Skipped: 0, Time elapsed: 208.423 sec <<< FAILURE! - in TestSuite
testUnsubmittedTaskWithExecutionContextTimesOutWhenImmediate(org.apache.brooklyn.util.core.task.ValueResolverTest)  Time elapsed: 0.012 sec  <<< FAILURE!
java.lang.AssertionError: result=Absent[] expected [true] but found [false]
	at org.apache.brooklyn.util.core.task.ValueResolverTest.testUnsubmittedTaskWithExecutionContextTimesOutWhenImmediate(ValueResolverTest.java:159)

2018-12-07 06:49:08,988 INFO  - Brooklyn shutdown: stopping entities [TestEntityImpl{id=r4blousrmi}, TestEntityImpl{id=bndd9mkutl}, BlockingEntityImpl{id=j477a0j1go}]

Results :

Failed tests: 
  ValueResolverTest.testUnsubmittedTaskWithExecutionContextTimesOutWhenImmediate:159 result=Absent[] expected [true] but found [false]

Tests run: 2348, Failures: 1, Errors: 0, Skipped: 0

[INFO] ------------------------------------------------------------------------
[INFO] Reactor Summary:
[INFO] 
[INFO] Brooklyn Server Root ............................... SUCCESS [  4.942 s]
[INFO] Brooklyn Parent Project ............................ SUCCESS [  5.440 s]
[INFO] Brooklyn Test Support Utilities .................... SUCCESS [  8.388 s]
[INFO] Brooklyn Logback Includable Configuration .......... SUCCESS [  0.387 s]
[INFO] Brooklyn Common Utilities .......................... SUCCESS [ 28.962 s]
[INFO] Brooklyn API ....................................... SUCCESS [  3.423 s]
[INFO] CAMP Server Parent Project ......................... SUCCESS [  0.135 s]
[INFO] CAMP Base .......................................... SUCCESS [  3.794 s]
[INFO] Brooklyn Test Support .............................. SUCCESS [  2.450 s]
[INFO] Brooklyn REST Swagger Apidoc Utilities ............. SUCCESS [ 14.105 s]
[INFO] Brooklyn Logback Configuration ..................... SUCCESS [  0.218 s]
[INFO] CAMP Server ........................................ SUCCESS [ 13.778 s]
[INFO] Brooklyn Felix Runtime ............................. SUCCESS [  3.364 s]
[INFO] Brooklyn Groovy Utilities .......................... SUCCESS [  2.165 s]
[INFO] Brooklyn Core ...................................... FAILURE [04:21 min]
[INFO] Brooklyn Policies .................................. SKIPPED
[INFO] Brooklyn WinRM Software Entities ................... SKIPPED
[INFO] Brooklyn Secure JMXMP Agent ........................ SKIPPED
[INFO] Brooklyn JMX RMI Agent ............................. SKIPPED
[INFO] Brooklyn Jclouds Location Targets .................. SKIPPED
[INFO] Brooklyn Software Base ............................. SKIPPED
[INFO] Brooklyn CAMP ...................................... SKIPPED
[INFO] Brooklyn Launcher Common ........................... SKIPPED
[INFO] Brooklyn REST API .................................. SKIPPED
[INFO] Brooklyn REST Resources ............................ SKIPPED
[INFO] Brooklyn REST Server ............................... SKIPPED
[INFO] Brooklyn Launcher .................................. SKIPPED
[INFO] Brooklyn Container Location Targets ................ SKIPPED
[INFO] Brooklyn Command Line Interface .................... SKIPPED
[INFO] Brooklyn Test Framework ............................ SKIPPED
[INFO] Brooklyn OSGi init ................................. SKIPPED
[INFO] Brooklyn OSGi start ................................ SKIPPED
[INFO] Brooklyn Karaf ..................................... SKIPPED
[INFO] Jetty config fragment .............................. SKIPPED
[INFO] Apache Http Component extension .................... SKIPPED
[INFO] Brooklyn Karaf Features ............................ SKIPPED
[INFO] Brooklyn Karaf Shell Commands ...................... SKIPPED
[INFO] Brooklyn UI :: Parent .............................. SKIPPED
[INFO] Brooklyn UI :: Modularity Server (parent) .......... SKIPPED
[INFO] Brooklyn UI :: Modularity Server :: UI Module API .. SKIPPED
[INFO] Brooklyn UI :: Modularity Server :: UI Module Registry SKIPPED
[INFO] Brooklyn UI :: Modularity Server :: UI Proxy ....... SKIPPED
[INFO] Brooklyn UI :: Modularity Server :: UI Metadata Registry SKIPPED
[INFO] Brooklyn UI :: Modularity Server :: External UI Modules Registration Hooks SKIPPED
[INFO] Brooklyn UI :: Modularity Server :: Features ....... SKIPPED
[INFO] Brooklyn UI :: Modules (parent) .................... SKIPPED
[INFO] Brooklyn UI :: Modules - UI Utils .................. SKIPPED
[INFO] Brooklyn UI :: Modules - Home ...................... SKIPPED
[INFO] Brooklyn UI :: Modules - App inspector ............. SKIPPED
[INFO] Brooklyn UI :: Modules - Blueprint composer ........ SKIPPED
[INFO] Brooklyn UI :: Modules - Blueprint importer ........ SKIPPED
[INFO] Brooklyn UI :: Modules - Catalog ................... SKIPPED
[INFO] Brooklyn UI :: Modules - Location manager .......... SKIPPED
[INFO] Brooklyn UI :: Modules - REST API Docs ............. SKIPPED
[INFO] Brooklyn UI :: Modules - Groovy console ............ SKIPPED
[INFO] Brooklyn UI :: Modules - Logout .................... SKIPPED
[INFO] Brooklyn UI :: Modules - Features .................. SKIPPED
[INFO] Brooklyn UI :: Features ............................ SKIPPED
[INFO] Brooklyn Library Root .............................. SKIPPED
[INFO] Brooklyn CM Chef ................................... SKIPPED
[INFO] Brooklyn CM SaltStack .............................. SKIPPED
[INFO] Brooklyn CM Ansible ................................ SKIPPED
[INFO] Brooklyn CM Integration Root ....................... SKIPPED
[INFO] Brooklyn Network Software Entities ................. SKIPPED
[INFO] Brooklyn OSGi Software Entities .................... SKIPPED
[INFO] Brooklyn Database Software Entities ................ SKIPPED
[INFO] Brooklyn Web App Software Entities ................. SKIPPED
[INFO] Brooklyn Messaging Software Entities ............... SKIPPED
[INFO] Brooklyn NoSQL Data Store Software Entities ........ SKIPPED
[INFO] Brooklyn Monitoring Software Entities .............. SKIPPED
[INFO] Brooklyn Web App Software Entities ................. SKIPPED
[INFO] Brooklyn QA ........................................ SKIPPED
[INFO] Brooklyn Examples Aggregator Project ............... SKIPPED
[INFO] Brooklyn Examples Aggregator Project - Webapps ..... SKIPPED
[INFO] hello-world-webapp Maven Webapp .................... SKIPPED
[INFO] hello-world-sql-webapp Maven Webapp ................ SKIPPED
[INFO] Brooklyn Simple Web Cluster Example ................ SKIPPED
[INFO] Brooklyn Library Karaf integration ................. SKIPPED
[INFO] Brooklyn Library Catalog ........................... SKIPPED
[INFO] Brooklyn Library Karaf Features .................... SKIPPED
[INFO] Brooklyn Client .................................... SKIPPED
[INFO] Brooklyn Client Command Line Interface ............. SKIPPED
[INFO] Brooklyn REST java Client .......................... SKIPPED
[INFO] Brooklyn Downstream Project Parent ................. SKIPPED
[INFO] Brooklyn Dist Root ................................. SKIPPED
[INFO] Brooklyn All Things ................................ SKIPPED
[INFO] Brooklyn Distribution .............................. SKIPPED
[INFO] Brooklyn Karaf Distribution Parent ................. SKIPPED
[INFO] Brooklyn Karaf Server Configuration ................ SKIPPED
[INFO] Brooklyn Dist Karaf Features ....................... SKIPPED
[INFO] Brooklyn Karaf Distribution ........................ SKIPPED
[INFO] Brooklyn Karaf pax-exam itest ...................... SKIPPED
[INFO] Brooklyn Vagrant Getting Started Environment ....... SKIPPED
[INFO] Brooklyn Quick-Start Project Archetype ............. SKIPPED
[INFO] Brooklyn Shared Package Files ...................... SKIPPED
[INFO] Brooklyn RPM Package ............................... SKIPPED
[INFO] Brooklyn DEB Package ............................... SKIPPED
[INFO] Brooklyn Root 1.0.0-SNAPSHOT ....................... SKIPPED
[INFO] ------------------------------------------------------------------------
[INFO] BUILD FAILURE
[INFO] ------------------------------------------------------------------------
[INFO] Total time: 06:16 min
[INFO] Finished at: 2018-12-07T06:49:09Z
[INFO] ------------------------------------------------------------------------
[ERROR] Failed to execute goal org.apache.maven.plugins:maven-surefire-plugin:2.19.1:test (default-test) on project brooklyn-core: There are test failures.
[ERROR] 
[ERROR] Please refer to /usr/build/brooklyn-server/core/target/surefire-reports for the individual test results.
[ERROR] -> [Help 1]
[ERROR] 
[ERROR] To see the full stack trace of the errors, re-run Maven with the -e switch.
[ERROR] Re-run Maven using the -X switch to enable full debug logging.
[ERROR] 
[ERROR] For more information about the errors and possible solutions, please read the following articles:
[ERROR] [Help 1] http://cwiki.apache.org/confluence/display/MAVEN/MojoFailureException
[ERROR] 
[ERROR] After correcting the problems, you can resume the build with the command
[ERROR]   mvn <goals> -rf :brooklyn-core
Build step 'Execute shell' marked build as failure
Recording test results
TestNG Reports Processing: START
Looking for TestNG results report in workspace using pattern: **/testng-results.xml
Saving reports...
Processing '/x1/jenkins/jenkins-home/jobs/brooklyn-master-build-docker/builds/1115/testng/testng-results-1.xml'
Processing '/x1/jenkins/jenkins-home/jobs/brooklyn-master-build-docker/builds/1115/testng/testng-results-2.xml'
Processing '/x1/jenkins/jenkins-home/jobs/brooklyn-master-build-docker/builds/1115/testng/testng-results-3.xml'
Processing '/x1/jenkins/jenkins-home/jobs/brooklyn-master-build-docker/builds/1115/testng/testng-results-4.xml'
Processing '/x1/jenkins/jenkins-home/jobs/brooklyn-master-build-docker/builds/1115/testng/testng-results-5.xml'
Processing '/x1/jenkins/jenkins-home/jobs/brooklyn-master-build-docker/builds/1115/testng/testng-results-6.xml'
Processing '/x1/jenkins/jenkins-home/jobs/brooklyn-master-build-docker/builds/1115/testng/testng-results.xml'
0.033807% of tests failed, which exceeded threshold of 0%. Marking build as UNSTABLE
TestNG Reports Processing: FINISH