git.net

[Date Prev][Date Next][Thread Prev][Thread Next][Date Index][Thread Index]

Build failed in Jenkins: brooklyn-master-build-docker #1114


See <https://builds.apache.org/job/brooklyn-master-build-docker/1114/display/redirect>

------------------------------------------
[...truncated 47.58 MB...]
2018-12-06 23:27:42,133 INFO  - Added external config supplier named 'brooklyn-demo-sample': org.apache.brooklyn.core.config.external.InPlaceExternalConfigSupplier@551be9f6
2018-12-06 23:27:42,188 INFO  - TESTNG PASSED CONFIGURATION: "Surefire test" - @BeforeMethod org.apache.brooklyn.test.framework.TestEffectorTest.setUp() finished in 58 ms
2018-12-06 23:27:42,189 INFO  - TESTNG INVOKING: "Surefire test" - org.apache.brooklyn.test.framework.TestEffectorTest.testEffectorNegativeAssertions()
2018-12-06 23:27:42,227 WARN  BQnXXXE8-[ahe2d5doc9,j3mztpipai,p0jnqtkc4z] Repeater: error caught checking condition: effectorReturnsString expected equalTo Not the string I expected but found Goodbye World!
2018-12-06 23:27:42,227 WARN  BQnXXXE8-[ahe2d5doc9,j3mztpipai,p0jnqtkc4z] Error invoking start at TestEffectorImpl{id=p0jnqtkc4z}: AssertionError: effectorReturnsString expected equalTo Not the string I expected but found Goodbye World!
2018-12-06 23:27:42,237 WARN  kpXnOFmX-[ahe2d5doc9,j3mztpipai] Error invoking start at TestCaseImpl{id=j3mztpipai}: Error invoking start at TestEffectorImpl{id=p0jnqtkc4z}: AssertionError: effectorReturnsString expected equalTo Not the string I expected but found Goodbye World!
2018-12-06 23:27:42,242 WARN  - Setting Application[e2d5doc9] on-fire due to problems when expected running, up=false, problems: {service-lifecycle-indicators-from-children-and-members=Required entity not healthy: TestCase:j3mz (j3mztpipai)}
2018-12-06 23:27:42,242 WARN  SU6YaCcC-[ahe2d5doc9] Setting Application[e2d5doc9] on-fire due to problems when expected running, up=false, problems: {service-lifecycle-indicators-from-children-and-members=Required entity not healthy: TestCase:j3mz (j3mztpipai)}
2018-12-06 23:27:42,246 WARN  SU6YaCcC-[ahe2d5doc9] Error invoking start at Application[e2d5doc9]: ProblemStartingChildrenException: org.apache.brooklyn.util.exceptions.PropagatedRuntimeException: Error invoking start at TestCaseImpl{id=j3mztpipai}: Error invoking start at TestEffectorImpl{id=p0jnqtkc4z}: AssertionError: effectorReturnsString expected equalTo Not the string I expected but found Goodbye World!
2018-12-06 23:27:42,257 INFO  - TESTNG PASSED: "Surefire test" - org.apache.brooklyn.test.framework.TestEffectorTest.testEffectorNegativeAssertions() finished in 69 ms
2018-12-06 23:27:42,262 INFO  - TESTNG INVOKING CONFIGURATION: "Surefire test" - @AfterMethod org.apache.brooklyn.core.test.BrooklynMgmtUnitTestSupport.tearDown()
2018-12-06 23:27:42,270 INFO  - TESTNG PASSED CONFIGURATION: "Surefire test" - @AfterMethod org.apache.brooklyn.core.test.BrooklynMgmtUnitTestSupport.tearDown() finished in 8 ms
2018-12-06 23:27:42,271 INFO  - TESTNG INVOKING CONFIGURATION: "Surefire test" - @BeforeMethod org.apache.brooklyn.test.framework.TestEffectorTest.setUp()
2018-12-06 23:27:42,273 INFO  - Added external config supplier named 'brooklyn-demo-sample': org.apache.brooklyn.core.config.external.InPlaceExternalConfigSupplier@bb3ecfe
2018-12-06 23:27:42,310 INFO  - TESTNG PASSED CONFIGURATION: "Surefire test" - @BeforeMethod org.apache.brooklyn.test.framework.TestEffectorTest.setUp() finished in 39 ms
2018-12-06 23:27:42,311 INFO  - TESTNG INVOKING: "Surefire test" - org.apache.brooklyn.test.framework.TestEffectorTest.testEffectorPositiveAssertions()
2018-12-06 23:27:42,388 INFO  - TESTNG PASSED: "Surefire test" - org.apache.brooklyn.test.framework.TestEffectorTest.testEffectorPositiveAssertions() finished in 78 ms
2018-12-06 23:27:42,388 INFO  - TESTNG INVOKING CONFIGURATION: "Surefire test" - @AfterMethod org.apache.brooklyn.core.test.BrooklynMgmtUnitTestSupport.tearDown()
2018-12-06 23:27:42,405 INFO  - TESTNG PASSED CONFIGURATION: "Surefire test" - @AfterMethod org.apache.brooklyn.core.test.BrooklynMgmtUnitTestSupport.tearDown() finished in 17 ms
2018-12-06 23:27:42,408 INFO  - TESTNG INVOKING CONFIGURATION: "Surefire test" - @BeforeMethod org.apache.brooklyn.test.framework.TestEffectorTest.setUp()
2018-12-06 23:27:42,409 INFO  - Added external config supplier named 'brooklyn-demo-sample': org.apache.brooklyn.core.config.external.InPlaceExternalConfigSupplier@7ddcb0dc
2018-12-06 23:27:42,441 INFO  - TESTNG PASSED CONFIGURATION: "Surefire test" - @BeforeMethod org.apache.brooklyn.test.framework.TestEffectorTest.setUp() finished in 33 ms
2018-12-06 23:27:42,442 INFO  - TESTNG INVOKING: "Surefire test" - org.apache.brooklyn.test.framework.TestEffectorTest.testEffectorReturnsInt()
2018-12-06 23:27:42,489 INFO  - TESTNG PASSED: "Surefire test" - org.apache.brooklyn.test.framework.TestEffectorTest.testEffectorReturnsInt() finished in 48 ms
2018-12-06 23:27:42,489 INFO  - TESTNG INVOKING CONFIGURATION: "Surefire test" - @AfterMethod org.apache.brooklyn.core.test.BrooklynMgmtUnitTestSupport.tearDown()
2018-12-06 23:27:42,512 INFO  - TESTNG PASSED CONFIGURATION: "Surefire test" - @AfterMethod org.apache.brooklyn.core.test.BrooklynMgmtUnitTestSupport.tearDown() finished in 22 ms
2018-12-06 23:27:42,512 INFO  - TESTNG INVOKING CONFIGURATION: "Surefire test" - @BeforeMethod org.apache.brooklyn.test.framework.TestEffectorTest.setUp()
2018-12-06 23:27:42,512 INFO  - Added external config supplier named 'brooklyn-demo-sample': org.apache.brooklyn.core.config.external.InPlaceExternalConfigSupplier@418f890f
2018-12-06 23:27:42,556 INFO  - TESTNG PASSED CONFIGURATION: "Surefire test" - @BeforeMethod org.apache.brooklyn.test.framework.TestEffectorTest.setUp() finished in 44 ms
2018-12-06 23:27:42,565 INFO  - TESTNG INVOKING: "Surefire test" - org.apache.brooklyn.test.framework.TestEffectorTest.testEffectorTimeout()
2018-12-06 23:27:42,618 WARN  ndxPEDMY-[eqw6sa0bmv,bye3p1oe7b,sq5ake9k6x] Repeater: error caught checking condition: Effector effectorHangs timed out after 10ms
2018-12-06 23:27:42,624 WARN  ndxPEDMY-[eqw6sa0bmv,bye3p1oe7b,sq5ake9k6x] Error invoking start at TestEffectorImpl{id=sq5ake9k6x}: AssertionError: Effector effectorHangs timed out after 10ms
2018-12-06 23:27:42,625 WARN  QWKLxFxx-[eqw6sa0bmv,bye3p1oe7b] Error invoking start at TestCaseImpl{id=bye3p1oe7b}: Error invoking start at TestEffectorImpl{id=sq5ake9k6x}: AssertionError: Effector effectorHangs timed out after 10ms
2018-12-06 23:27:42,629 WARN  Wp3Aojsj-[eqw6sa0bmv] Setting Application[w6sa0bmv] on-fire due to problems when expected running, up=false, problems: {service-lifecycle-indicators-from-children-and-members=Required entity not healthy: TestCase:bye3 (bye3p1oe7b)}
2018-12-06 23:27:42,629 WARN  Wp3Aojsj-[eqw6sa0bmv] Error invoking start at Application[w6sa0bmv]: ProblemStartingChildrenException: org.apache.brooklyn.util.exceptions.PropagatedRuntimeException: Error invoking start at TestCaseImpl{id=bye3p1oe7b}: Error invoking start at TestEffectorImpl{id=sq5ake9k6x}: AssertionError: Effector effectorHangs timed out after 10ms
2018-12-06 23:27:42,633 INFO  - TESTNG PASSED: "Surefire test" - org.apache.brooklyn.test.framework.TestEffectorTest.testEffectorTimeout() finished in 69 ms
2018-12-06 23:27:42,633 INFO  - TESTNG INVOKING CONFIGURATION: "Surefire test" - @AfterMethod org.apache.brooklyn.core.test.BrooklynMgmtUnitTestSupport.tearDown()
2018-12-06 23:27:42,640 WARN  B6GygnVZ-[eqw6sa0bmv,bye3p1oe7b,qgjpkgesd0] Error invoking effectorHangs at TestEntityImpl{id=qgjpkgesd0}: RuntimeInterruptedException: java.lang.InterruptedException: sleep interrupted
2018-12-06 23:27:42,647 INFO  - TESTNG PASSED CONFIGURATION: "Surefire test" - @AfterMethod org.apache.brooklyn.core.test.BrooklynMgmtUnitTestSupport.tearDown() finished in 14 ms
2018-12-06 23:27:42,648 INFO  - TESTNG INVOKING CONFIGURATION: "Surefire test" - @BeforeMethod org.apache.brooklyn.test.framework.TestEffectorTest.setUp()
2018-12-06 23:27:42,648 INFO  - Added external config supplier named 'brooklyn-demo-sample': org.apache.brooklyn.core.config.external.InPlaceExternalConfigSupplier@634f58d2
2018-12-06 23:27:42,684 INFO  - TESTNG PASSED CONFIGURATION: "Surefire test" - @BeforeMethod org.apache.brooklyn.test.framework.TestEffectorTest.setUp() finished in 36 ms
2018-12-06 23:27:42,684 INFO  - TESTNG INVOKING: "Surefire test" - org.apache.brooklyn.test.framework.TestEffectorTest.testEffectorTimeoutAppliesOnlyToCallAndNotToAssertionCheck()
2018-12-06 23:27:42,699 WARN  d94v14g9-[v1csihcs0h,i49jjdmz90,r09pe0y0m5] Repeater: error caught checking condition: effectorReturnsString expected equalTo Not the string I expected but found Goodbye World!
2018-12-06 23:27:42,699 WARN  d94v14g9-[v1csihcs0h,i49jjdmz90,r09pe0y0m5] Error invoking start at TestEffectorImpl{id=r09pe0y0m5}: AssertionError: effectorReturnsString expected equalTo Not the string I expected but found Goodbye World!
2018-12-06 23:27:42,702 WARN  tTMCX4jf-[v1csihcs0h,i49jjdmz90] Error invoking start at TestCaseImpl{id=i49jjdmz90}: Error invoking start at TestEffectorImpl{id=r09pe0y0m5}: AssertionError: effectorReturnsString expected equalTo Not the string I expected but found Goodbye World!
2018-12-06 23:27:42,706 WARN  jktV0zlD-[v1csihcs0h] Setting Application[csihcs0h] on-fire due to problems when expected running, up=false, problems: {service-lifecycle-indicators-from-children-and-members=Required entity not healthy: TestCase:i49j (i49jjdmz90)}
2018-12-06 23:27:42,706 WARN  - Setting Application[csihcs0h] on-fire due to problems when expected running, up=false, problems: {service-lifecycle-indicators-from-children-and-members=Required entity not healthy: TestCase:i49j (i49jjdmz90)}
2018-12-06 23:27:42,706 WARN  jktV0zlD-[v1csihcs0h] Error invoking start at Application[csihcs0h]: ProblemStartingChildrenException: org.apache.brooklyn.util.exceptions.PropagatedRuntimeException: Error invoking start at TestCaseImpl{id=i49jjdmz90}: Error invoking start at TestEffectorImpl{id=r09pe0y0m5}: AssertionError: effectorReturnsString expected equalTo Not the string I expected but found Goodbye World!
2018-12-06 23:27:42,712 INFO  - TESTNG PASSED: "Surefire test" - org.apache.brooklyn.test.framework.TestEffectorTest.testEffectorTimeoutAppliesOnlyToCallAndNotToAssertionCheck() finished in 28 ms
2018-12-06 23:27:42,712 INFO  - TESTNG INVOKING CONFIGURATION: "Surefire test" - @AfterMethod org.apache.brooklyn.core.test.BrooklynMgmtUnitTestSupport.tearDown()
2018-12-06 23:27:42,722 INFO  - TESTNG PASSED CONFIGURATION: "Surefire test" - @AfterMethod org.apache.brooklyn.core.test.BrooklynMgmtUnitTestSupport.tearDown() finished in 10 ms
2018-12-06 23:27:42,722 INFO  - TESTNG INVOKING CONFIGURATION: "Surefire test" - @BeforeMethod org.apache.brooklyn.test.framework.TestEffectorTest.setUp()
2018-12-06 23:27:42,722 INFO  - Added external config supplier named 'brooklyn-demo-sample': org.apache.brooklyn.core.config.external.InPlaceExternalConfigSupplier@16cf8438
2018-12-06 23:27:42,759 INFO  - TESTNG PASSED CONFIGURATION: "Surefire test" - @BeforeMethod org.apache.brooklyn.test.framework.TestEffectorTest.setUp() finished in 29 ms
2018-12-06 23:27:42,759 INFO  - TESTNG INVOKING: "Surefire test" - org.apache.brooklyn.test.framework.TestEffectorTest.testFailFastIfNoEffector()
2018-12-06 23:27:42,781 WARN  hw4Xq8kN-[leibxdw897,qijnj0zmoh,ih1euvnwg7] Error invoking start at TestEffectorImpl{id=ih1euvnwg7}: NullPointerException: config effector[ConfigKey:java.lang.String] must not be null
2018-12-06 23:27:42,783 WARN  Ykd28yIr-[leibxdw897,qijnj0zmoh] Error invoking start at TestCaseImpl{id=qijnj0zmoh}: Error invoking start at TestEffectorImpl{id=ih1euvnwg7}: NullPointerException: config effector[ConfigKey:java.lang.String] must not be null
2018-12-06 23:27:42,789 WARN  - Setting Application[ibxdw897] on-fire due to problems when expected running, up=false, problems: {service-lifecycle-indicators-from-children-and-members=Required entity not healthy: TestCase:qijn (qijnj0zmoh)}
2018-12-06 23:27:42,789 WARN  RP3w9d9t-[leibxdw897] Setting Application[ibxdw897] on-fire due to problems when expected running, up=false, problems: {service-lifecycle-indicators-from-children-and-members=Required entity not healthy: TestCase:qijn (qijnj0zmoh)}
2018-12-06 23:27:42,790 WARN  RP3w9d9t-[leibxdw897] Error invoking start at Application[ibxdw897]: ProblemStartingChildrenException: org.apache.brooklyn.util.exceptions.PropagatedRuntimeException: Error invoking start at TestCaseImpl{id=qijnj0zmoh}: Error invoking start at TestEffectorImpl{id=ih1euvnwg7}: NullPointerException: config effector[ConfigKey:java.lang.String] must not be null
2018-12-06 23:27:42,797 INFO  - TESTNG PASSED: "Surefire test" - org.apache.brooklyn.test.framework.TestEffectorTest.testFailFastIfNoEffector() finished in 38 ms
2018-12-06 23:27:42,797 INFO  - TESTNG INVOKING CONFIGURATION: "Surefire test" - @AfterMethod org.apache.brooklyn.core.test.BrooklynMgmtUnitTestSupport.tearDown()
2018-12-06 23:27:42,829 INFO  - TESTNG PASSED CONFIGURATION: "Surefire test" - @AfterMethod org.apache.brooklyn.core.test.BrooklynMgmtUnitTestSupport.tearDown() finished in 32 ms
2018-12-06 23:27:42,829 INFO  - TESTNG INVOKING CONFIGURATION: "Surefire test" - @BeforeMethod org.apache.brooklyn.test.framework.TestEffectorTest.setUp()
2018-12-06 23:27:42,830 INFO  - Added external config supplier named 'brooklyn-demo-sample': org.apache.brooklyn.core.config.external.InPlaceExternalConfigSupplier@119290b9
[GC (Allocation Failure)  250781K->22451K(769536K), 0.0253112 secs]
2018-12-06 23:27:42,922 INFO  - TESTNG PASSED CONFIGURATION: "Surefire test" - @BeforeMethod org.apache.brooklyn.test.framework.TestEffectorTest.setUp() finished in 93 ms
2018-12-06 23:27:42,922 INFO  - TESTNG INVOKING: "Surefire test" - org.apache.brooklyn.test.framework.TestEffectorTest.testFailFastIfNoTargetEntity()
2018-12-06 23:27:42,940 WARN  kLZW3FfP-[qscm015mm6,rvuichucc7,e06uvaht6n] Error invoking start at TestEffectorImpl{id=e06uvaht6n}: Cannot resolve target entity
2018-12-06 23:27:42,945 WARN  KjSYJMqo-[qscm015mm6,rvuichucc7] Error invoking start at TestCaseImpl{id=rvuichucc7}: Error invoking start at TestEffectorImpl{id=e06uvaht6n}: Cannot resolve target entity
2018-12-06 23:27:42,956 WARN  OtQt2fYH-[qscm015mm6] Setting Application[cm015mm6] on-fire due to problems when expected running, up=false, problems: {service-lifecycle-indicators-from-children-and-members=Required entity not healthy: TestCase:rvui (rvuichucc7)}
2018-12-06 23:27:42,959 WARN  OtQt2fYH-[qscm015mm6] Error invoking start at Application[cm015mm6]: ProblemStartingChildrenException: org.apache.brooklyn.util.exceptions.PropagatedRuntimeException: Error invoking start at TestCaseImpl{id=rvuichucc7}: Error invoking start at TestEffectorImpl{id=e06uvaht6n}: Cannot resolve target entity
2018-12-06 23:27:42,965 INFO  - TESTNG PASSED: "Surefire test" - org.apache.brooklyn.test.framework.TestEffectorTest.testFailFastIfNoTargetEntity() finished in 43 ms
2018-12-06 23:27:42,965 INFO  - TESTNG INVOKING CONFIGURATION: "Surefire test" - @AfterMethod org.apache.brooklyn.core.test.BrooklynMgmtUnitTestSupport.tearDown()
2018-12-06 23:27:43,008 INFO  - TESTNG PASSED CONFIGURATION: "Surefire test" - @AfterMethod org.apache.brooklyn.core.test.BrooklynMgmtUnitTestSupport.tearDown() finished in 43 ms
2018-12-06 23:27:43,009 INFO  - TESTNG INVOKING CONFIGURATION: "Surefire test" - @BeforeMethod org.apache.brooklyn.test.framework.TestEffectorTest.setUp()
2018-12-06 23:27:43,009 INFO  - Added external config supplier named 'brooklyn-demo-sample': org.apache.brooklyn.core.config.external.InPlaceExternalConfigSupplier@6de7778f
2018-12-06 23:27:43,064 INFO  - TESTNG PASSED CONFIGURATION: "Surefire test" - @BeforeMethod org.apache.brooklyn.test.framework.TestEffectorTest.setUp() finished in 55 ms
2018-12-06 23:27:43,064 INFO  - TESTNG INVOKING: "Surefire test" - org.apache.brooklyn.test.framework.TestEffectorTest.testSimpleEffector()
2018-12-06 23:27:43,140 INFO  - TESTNG PASSED: "Surefire test" - org.apache.brooklyn.test.framework.TestEffectorTest.testSimpleEffector() finished in 76 ms
2018-12-06 23:27:43,141 INFO  - TESTNG INVOKING CONFIGURATION: "Surefire test" - @AfterMethod org.apache.brooklyn.core.test.BrooklynMgmtUnitTestSupport.tearDown()
2018-12-06 23:27:43,160 INFO  - TESTNG PASSED CONFIGURATION: "Surefire test" - @AfterMethod org.apache.brooklyn.core.test.BrooklynMgmtUnitTestSupport.tearDown() finished in 19 ms
2018-12-06 23:27:43,206 INFO  - TESTNG 
===============================================
    Surefire test
    Tests run: 235, Failures: 1, Skips: 0
===============================================
Tests run: 235, Failures: 1, Errors: 0, Skipped: 0, Time elapsed: 24.178 sec <<< FAILURE! - in TestSuite
testEffectorFailureRetriedUpToMaxAttempts(org.apache.brooklyn.test.framework.TestEffectorTest)  Time elapsed: 0.062 sec  <<< FAILURE!
java.lang.AssertionError: expected [2] but found [1]
	at org.apache.brooklyn.test.framework.TestEffectorTest.testEffectorFailureRetriedUpToMaxAttempts(TestEffectorTest.java:247)


Results :

Failed tests: 
  TestEffectorTest.testEffectorFailureRetriedUpToMaxAttempts:247 expected [2] but found [1]

Tests run: 235, Failures: 1, Errors: 0, Skipped: 0

[INFO] ------------------------------------------------------------------------
[INFO] Reactor Summary:
[INFO] 
[INFO] Brooklyn Server Root ............................... SUCCESS [  6.649 s]
[INFO] Brooklyn Parent Project ............................ SUCCESS [  8.428 s]
[INFO] Brooklyn Test Support Utilities .................... SUCCESS [ 10.925 s]
[INFO] Brooklyn Logback Includable Configuration .......... SUCCESS [  0.569 s]
[INFO] Brooklyn Common Utilities .......................... SUCCESS [ 36.629 s]
[INFO] Brooklyn API ....................................... SUCCESS [  4.221 s]
[INFO] CAMP Server Parent Project ......................... SUCCESS [  0.104 s]
[INFO] CAMP Base .......................................... SUCCESS [  4.397 s]
[INFO] Brooklyn Test Support .............................. SUCCESS [  2.504 s]
[INFO] Brooklyn REST Swagger Apidoc Utilities ............. SUCCESS [ 17.632 s]
[INFO] Brooklyn Logback Configuration ..................... SUCCESS [  0.253 s]
[INFO] CAMP Server ........................................ SUCCESS [ 17.191 s]
[INFO] Brooklyn Felix Runtime ............................. SUCCESS [  3.913 s]
[INFO] Brooklyn Groovy Utilities .......................... SUCCESS [  2.406 s]
[INFO] Brooklyn Core ...................................... SUCCESS [04:37 min]
[INFO] Brooklyn Policies .................................. SUCCESS [ 42.872 s]
[INFO] Brooklyn WinRM Software Entities ................... SUCCESS [ 24.048 s]
[INFO] Brooklyn Secure JMXMP Agent ........................ SUCCESS [  9.017 s]
[INFO] Brooklyn JMX RMI Agent ............................. SUCCESS [  0.449 s]
[INFO] Brooklyn Jclouds Location Targets .................. SUCCESS [01:17 min]
[INFO] Brooklyn Software Base ............................. SUCCESS [01:37 min]
[INFO] Brooklyn CAMP ...................................... SUCCESS [02:49 min]
[INFO] Brooklyn Launcher Common ........................... SUCCESS [  5.116 s]
[INFO] Brooklyn REST API .................................. SUCCESS [ 10.737 s]
[INFO] Brooklyn REST Resources ............................ SUCCESS [01:02 min]
[INFO] Brooklyn REST Server ............................... SUCCESS [ 26.727 s]
[INFO] Brooklyn Launcher .................................. SUCCESS [04:24 min]
[INFO] Brooklyn Container Location Targets ................ SUCCESS [ 14.022 s]
[INFO] Brooklyn Command Line Interface .................... SUCCESS [ 11.869 s]
[INFO] Brooklyn Test Framework ............................ FAILURE [ 30.361 s]
[INFO] Brooklyn OSGi init ................................. SKIPPED
[INFO] Brooklyn OSGi start ................................ SKIPPED
[INFO] Brooklyn Karaf ..................................... SKIPPED
[INFO] Jetty config fragment .............................. SKIPPED
[INFO] Apache Http Component extension .................... SKIPPED
[INFO] Brooklyn Karaf Features ............................ SKIPPED
[INFO] Brooklyn Karaf Shell Commands ...................... SKIPPED
[INFO] Brooklyn UI :: Parent .............................. SKIPPED
[INFO] Brooklyn UI :: Modularity Server (parent) .......... SKIPPED
[INFO] Brooklyn UI :: Modularity Server :: UI Module API .. SKIPPED
[INFO] Brooklyn UI :: Modularity Server :: UI Module Registry SKIPPED
[INFO] Brooklyn UI :: Modularity Server :: UI Proxy ....... SKIPPED
[INFO] Brooklyn UI :: Modularity Server :: UI Metadata Registry SKIPPED
[INFO] Brooklyn UI :: Modularity Server :: External UI Modules Registration Hooks SKIPPED
[INFO] Brooklyn UI :: Modularity Server :: Features ....... SKIPPED
[INFO] Brooklyn UI :: Modules (parent) .................... SKIPPED
[INFO] Brooklyn UI :: Modules - UI Utils .................. SKIPPED
[INFO] Brooklyn UI :: Modules - Home ...................... SKIPPED
[INFO] Brooklyn UI :: Modules - App inspector ............. SKIPPED
[INFO] Brooklyn UI :: Modules - Blueprint composer ........ SKIPPED
[INFO] Brooklyn UI :: Modules - Blueprint importer ........ SKIPPED
[INFO] Brooklyn UI :: Modules - Catalog ................... SKIPPED
[INFO] Brooklyn UI :: Modules - Location manager .......... SKIPPED
[INFO] Brooklyn UI :: Modules - REST API Docs ............. SKIPPED
[INFO] Brooklyn UI :: Modules - Groovy console ............ SKIPPED
[INFO] Brooklyn UI :: Modules - Logout .................... SKIPPED
[INFO] Brooklyn UI :: Modules - Features .................. SKIPPED
[INFO] Brooklyn UI :: Features ............................ SKIPPED
[INFO] Brooklyn Library Root .............................. SKIPPED
[INFO] Brooklyn CM Chef ................................... SKIPPED
[INFO] Brooklyn CM SaltStack .............................. SKIPPED
[INFO] Brooklyn CM Ansible ................................ SKIPPED
[INFO] Brooklyn CM Integration Root ....................... SKIPPED
[INFO] Brooklyn Network Software Entities ................. SKIPPED
[INFO] Brooklyn OSGi Software Entities .................... SKIPPED
[INFO] Brooklyn Database Software Entities ................ SKIPPED
[INFO] Brooklyn Web App Software Entities ................. SKIPPED
[INFO] Brooklyn Messaging Software Entities ............... SKIPPED
[INFO] Brooklyn NoSQL Data Store Software Entities ........ SKIPPED
[INFO] Brooklyn Monitoring Software Entities .............. SKIPPED
[INFO] Brooklyn Web App Software Entities ................. SKIPPED
[INFO] Brooklyn QA ........................................ SKIPPED
[INFO] Brooklyn Examples Aggregator Project ............... SKIPPED
[INFO] Brooklyn Examples Aggregator Project - Webapps ..... SKIPPED
[INFO] hello-world-webapp Maven Webapp .................... SKIPPED
[INFO] hello-world-sql-webapp Maven Webapp ................ SKIPPED
[INFO] Brooklyn Simple Web Cluster Example ................ SKIPPED
[INFO] Brooklyn Library Karaf integration ................. SKIPPED
[INFO] Brooklyn Library Catalog ........................... SKIPPED
[INFO] Brooklyn Library Karaf Features .................... SKIPPED
[INFO] Brooklyn Client .................................... SKIPPED
[INFO] Brooklyn Client Command Line Interface ............. SKIPPED
[INFO] Brooklyn REST java Client .......................... SKIPPED
[INFO] Brooklyn Downstream Project Parent ................. SKIPPED
[INFO] Brooklyn Dist Root ................................. SKIPPED
[INFO] Brooklyn All Things ................................ SKIPPED
[INFO] Brooklyn Distribution .............................. SKIPPED
[INFO] Brooklyn Karaf Distribution Parent ................. SKIPPED
[INFO] Brooklyn Karaf Server Configuration ................ SKIPPED
[INFO] Brooklyn Dist Karaf Features ....................... SKIPPED
[INFO] Brooklyn Karaf Distribution ........................ SKIPPED
[INFO] Brooklyn Karaf pax-exam itest ...................... SKIPPED
[INFO] Brooklyn Vagrant Getting Started Environment ....... SKIPPED
[INFO] Brooklyn Quick-Start Project Archetype ............. SKIPPED
[INFO] Brooklyn Shared Package Files ...................... SKIPPED
[INFO] Brooklyn RPM Package ............................... SKIPPED
[INFO] Brooklyn DEB Package ............................... SKIPPED
[INFO] Brooklyn Root 1.0.0-SNAPSHOT ....................... SKIPPED
[INFO] ------------------------------------------------------------------------
[INFO] BUILD FAILURE
[INFO] ------------------------------------------------------------------------
[INFO] Total time: 21:17 min
[INFO] Finished at: 2018-12-06T23:27:43Z
[INFO] ------------------------------------------------------------------------
[ERROR] Failed to execute goal org.apache.maven.plugins:maven-surefire-plugin:2.19.1:test (default-test) on project brooklyn-test-framework: There are test failures.
[ERROR] 
[ERROR] Please refer to /usr/build/brooklyn-server/test-framework/target/surefire-reports for the individual test results.
[ERROR] -> [Help 1]
[ERROR] 
[ERROR] To see the full stack trace of the errors, re-run Maven with the -e switch.
[ERROR] Re-run Maven using the -X switch to enable full debug logging.
[ERROR] 
[ERROR] For more information about the errors and possible solutions, please read the following articles:
[ERROR] [Help 1] http://cwiki.apache.org/confluence/display/MAVEN/MojoFailureException
[ERROR] 
[ERROR] After correcting the problems, you can resume the build with the command
[ERROR]   mvn <goals> -rf :brooklyn-test-framework
Build step 'Execute shell' marked build as failure
Recording test results
TestNG Reports Processing: START
Looking for TestNG results report in workspace using pattern: **/testng-results.xml
Saving reports...
Processing '/x1/jenkins/jenkins-home/jobs/brooklyn-master-build-docker/builds/1114/testng/testng-results-1.xml'
Processing '/x1/jenkins/jenkins-home/jobs/brooklyn-master-build-docker/builds/1114/testng/testng-results-10.xml'
Processing '/x1/jenkins/jenkins-home/jobs/brooklyn-master-build-docker/builds/1114/testng/testng-results-11.xml'
Processing '/x1/jenkins/jenkins-home/jobs/brooklyn-master-build-docker/builds/1114/testng/testng-results-12.xml'
Processing '/x1/jenkins/jenkins-home/jobs/brooklyn-master-build-docker/builds/1114/testng/testng-results-13.xml'
Processing '/x1/jenkins/jenkins-home/jobs/brooklyn-master-build-docker/builds/1114/testng/testng-results-14.xml'
Processing '/x1/jenkins/jenkins-home/jobs/brooklyn-master-build-docker/builds/1114/testng/testng-results-15.xml'
Processing '/x1/jenkins/jenkins-home/jobs/brooklyn-master-build-docker/builds/1114/testng/testng-results-16.xml'
Processing '/x1/jenkins/jenkins-home/jobs/brooklyn-master-build-docker/builds/1114/testng/testng-results-17.xml'
Processing '/x1/jenkins/jenkins-home/jobs/brooklyn-master-build-docker/builds/1114/testng/testng-results-18.xml'
Processing '/x1/jenkins/jenkins-home/jobs/brooklyn-master-build-docker/builds/1114/testng/testng-results-19.xml'
Processing '/x1/jenkins/jenkins-home/jobs/brooklyn-master-build-docker/builds/1114/testng/testng-results-2.xml'
Processing '/x1/jenkins/jenkins-home/jobs/brooklyn-master-build-docker/builds/1114/testng/testng-results-20.xml'
Processing '/x1/jenkins/jenkins-home/jobs/brooklyn-master-build-docker/builds/1114/testng/testng-results-3.xml'
Processing '/x1/jenkins/jenkins-home/jobs/brooklyn-master-build-docker/builds/1114/testng/testng-results-4.xml'
Processing '/x1/jenkins/jenkins-home/jobs/brooklyn-master-build-docker/builds/1114/testng/testng-results-5.xml'
Processing '/x1/jenkins/jenkins-home/jobs/brooklyn-master-build-docker/builds/1114/testng/testng-results-6.xml'
Processing '/x1/jenkins/jenkins-home/jobs/brooklyn-master-build-docker/builds/1114/testng/testng-results-7.xml'
Processing '/x1/jenkins/jenkins-home/jobs/brooklyn-master-build-docker/builds/1114/testng/testng-results-8.xml'
Processing '/x1/jenkins/jenkins-home/jobs/brooklyn-master-build-docker/builds/1114/testng/testng-results-9.xml'
Processing '/x1/jenkins/jenkins-home/jobs/brooklyn-master-build-docker/builds/1114/testng/testng-results.xml'
0.019782% of tests failed, which exceeded threshold of 0%. Marking build as UNSTABLE
TestNG Reports Processing: FINISH