git.net

[Date Prev][Date Next][Thread Prev][Thread Next][Date Index][Thread Index]

Build failed in Jenkins: brooklyn-master-build-docker #1053


See <https://builds.apache.org/job/brooklyn-master-build-docker/1053/display/redirect>

------------------------------------------
[...truncated 6.16 MB...]
2018-11-25 16:03:59,652 INFO  - TESTNG INVOKING CONFIGURATION: "Surefire test" - @AfterMethod org.apache.brooklyn.core.mgmt.rebind.RebindTestFixture.tearDown()
2018-11-25 16:03:59,665 INFO  - TESTNG PASSED CONFIGURATION: "Surefire test" - @AfterMethod org.apache.brooklyn.core.mgmt.rebind.RebindTestFixture.tearDown() finished in 13 ms
2018-11-25 16:03:59,666 INFO  - TESTNG INVOKING CONFIGURATION: "Surefire test" - @BeforeMethod org.apache.brooklyn.core.test.BrooklynAppUnitTestSupport.setUp()
2018-11-25 16:03:59,666 INFO  - Added external config supplier named 'brooklyn-demo-sample': org.apache.brooklyn.core.config.external.InPlaceExternalConfigSupplier@70b21542
2018-11-25 16:03:59,681 INFO  - TESTNG PASSED CONFIGURATION: "Surefire test" - @BeforeMethod org.apache.brooklyn.core.test.BrooklynAppUnitTestSupport.setUp() finished in 15 ms
2018-11-25 16:03:59,681 INFO  - TESTNG INVOKING CONFIGURATION: "Surefire test" - @BeforeMethod org.apache.brooklyn.core.sensor.password.CreatePasswordSensorTest.setup()
2018-11-25 16:03:59,720 INFO  - TESTNG PASSED CONFIGURATION: "Surefire test" - @BeforeMethod org.apache.brooklyn.core.sensor.password.CreatePasswordSensorTest.setup() finished in 39 ms
2018-11-25 16:03:59,720 INFO  - TESTNG INVOKING: "Surefire test" - org.apache.brooklyn.core.sensor.password.CreatePasswordSensorTest.testCreatePasswordCharacterGroups()
2018-11-25 16:03:59,727 INFO  - TESTNG PASSED: "Surefire test" - org.apache.brooklyn.core.sensor.password.CreatePasswordSensorTest.testCreatePasswordCharacterGroups() finished in 7 ms
2018-11-25 16:03:59,727 INFO  - TESTNG INVOKING CONFIGURATION: "Surefire test" - @AfterMethod org.apache.brooklyn.core.test.BrooklynMgmtUnitTestSupport.tearDown()
2018-11-25 16:03:59,733 INFO  - TESTNG PASSED CONFIGURATION: "Surefire test" - @AfterMethod org.apache.brooklyn.core.test.BrooklynMgmtUnitTestSupport.tearDown() finished in 6 ms
2018-11-25 16:03:59,734 INFO  - TESTNG INVOKING CONFIGURATION: "Surefire test" - @BeforeMethod org.apache.brooklyn.core.test.BrooklynAppUnitTestSupport.setUp()
2018-11-25 16:03:59,734 INFO  - Added external config supplier named 'brooklyn-demo-sample': org.apache.brooklyn.core.config.external.InPlaceExternalConfigSupplier@330c5aae
2018-11-25 16:03:59,746 INFO  - TESTNG PASSED CONFIGURATION: "Surefire test" - @BeforeMethod org.apache.brooklyn.core.test.BrooklynAppUnitTestSupport.setUp() finished in 12 ms
2018-11-25 16:03:59,746 INFO  - TESTNG INVOKING CONFIGURATION: "Surefire test" - @BeforeMethod org.apache.brooklyn.core.sensor.password.CreatePasswordSensorTest.setup()
2018-11-25 16:03:59,778 INFO  - TESTNG PASSED CONFIGURATION: "Surefire test" - @BeforeMethod org.apache.brooklyn.core.sensor.password.CreatePasswordSensorTest.setup() finished in 32 ms
2018-11-25 16:03:59,778 INFO  - TESTNG INVOKING: "Surefire test" - org.apache.brooklyn.core.sensor.password.CreatePasswordSensorTest.testCreatePasswordCreatesAPasswordOfDefaultLength()
2018-11-25 16:03:59,779 INFO  - TESTNG PASSED: "Surefire test" - org.apache.brooklyn.core.sensor.password.CreatePasswordSensorTest.testCreatePasswordCreatesAPasswordOfDefaultLength() finished in 1 ms
2018-11-25 16:03:59,780 INFO  - TESTNG INVOKING CONFIGURATION: "Surefire test" - @AfterMethod org.apache.brooklyn.core.test.BrooklynMgmtUnitTestSupport.tearDown()
2018-11-25 16:03:59,785 INFO  - TESTNG PASSED CONFIGURATION: "Surefire test" - @AfterMethod org.apache.brooklyn.core.test.BrooklynMgmtUnitTestSupport.tearDown() finished in 5 ms
2018-11-25 16:03:59,786 INFO  - TESTNG INVOKING CONFIGURATION: "Surefire test" - @BeforeMethod org.apache.brooklyn.core.test.BrooklynAppUnitTestSupport.setUp()
2018-11-25 16:03:59,786 INFO  - Added external config supplier named 'brooklyn-demo-sample': org.apache.brooklyn.core.config.external.InPlaceExternalConfigSupplier@1902b41
2018-11-25 16:03:59,797 INFO  - TESTNG PASSED CONFIGURATION: "Surefire test" - @BeforeMethod org.apache.brooklyn.core.test.BrooklynAppUnitTestSupport.setUp() finished in 11 ms
2018-11-25 16:03:59,797 INFO  - TESTNG INVOKING: "Surefire test" - org.apache.brooklyn.core.sensor.DurationSinceSensorTest.testSensorAddedAndUpdated()
2018-11-25 16:03:59,870 INFO  - TESTNG PASSED: "Surefire test" - org.apache.brooklyn.core.sensor.DurationSinceSensorTest.testSensorAddedAndUpdated() finished in 73 ms
2018-11-25 16:03:59,870 INFO  - TESTNG INVOKING CONFIGURATION: "Surefire test" - @AfterMethod org.apache.brooklyn.core.test.BrooklynMgmtUnitTestSupport.tearDown()
2018-11-25 16:03:59,876 INFO  - TESTNG PASSED CONFIGURATION: "Surefire test" - @AfterMethod org.apache.brooklyn.core.test.BrooklynMgmtUnitTestSupport.tearDown() finished in 6 ms
2018-11-25 16:03:59,877 INFO  - TESTNG INVOKING CONFIGURATION: "Surefire test" - @BeforeMethod org.apache.brooklyn.core.sensor.http.HttpRequestSensorTest.setUp()
2018-11-25 16:03:59,880 INFO  - Added external config supplier named 'brooklyn-demo-sample': org.apache.brooklyn.core.config.external.InPlaceExternalConfigSupplier@288272dc
2018-11-25 16:03:59,921 INFO  - TESTNG PASSED CONFIGURATION: "Surefire test" - @BeforeMethod org.apache.brooklyn.core.sensor.http.HttpRequestSensorTest.setUp() finished in 44 ms
2018-11-25 16:03:59,921 INFO  - TESTNG INVOKING: "Surefire test" - org.apache.brooklyn.core.sensor.http.HttpRequestSensorTest.testDoNotParseJson()
2018-11-25 16:03:59,966 INFO  - TESTNG PASSED: "Surefire test" - org.apache.brooklyn.core.sensor.http.HttpRequestSensorTest.testDoNotParseJson() finished in 45 ms
2018-11-25 16:03:59,967 INFO  - TESTNG INVOKING CONFIGURATION: "Surefire test" - @AfterMethod org.apache.brooklyn.core.sensor.http.HttpRequestSensorTest.tearDown()
2018-11-25 16:03:59,973 INFO  - TESTNG PASSED CONFIGURATION: "Surefire test" - @AfterMethod org.apache.brooklyn.core.sensor.http.HttpRequestSensorTest.tearDown() finished in 7 ms
2018-11-25 16:03:59,973 INFO  - TESTNG INVOKING CONFIGURATION: "Surefire test" - @BeforeMethod org.apache.brooklyn.core.sensor.http.HttpRequestSensorTest.setUp()
2018-11-25 16:03:59,975 INFO  - Added external config supplier named 'brooklyn-demo-sample': org.apache.brooklyn.core.config.external.InPlaceExternalConfigSupplier@5f80f665
2018-11-25 16:04:00,021 INFO  - TESTNG PASSED CONFIGURATION: "Surefire test" - @BeforeMethod org.apache.brooklyn.core.sensor.http.HttpRequestSensorTest.setUp() finished in 48 ms
2018-11-25 16:04:00,021 INFO  - TESTNG INVOKING: "Surefire test" - org.apache.brooklyn.core.sensor.http.HttpRequestSensorTest.testHttpSensor()
2018-11-25 16:04:00,034 INFO  - TESTNG PASSED: "Surefire test" - org.apache.brooklyn.core.sensor.http.HttpRequestSensorTest.testHttpSensor() finished in 13 ms
2018-11-25 16:04:00,034 INFO  - TESTNG INVOKING CONFIGURATION: "Surefire test" - @AfterMethod org.apache.brooklyn.core.sensor.http.HttpRequestSensorTest.tearDown()
2018-11-25 16:04:00,041 INFO  - TESTNG PASSED CONFIGURATION: "Surefire test" - @AfterMethod org.apache.brooklyn.core.sensor.http.HttpRequestSensorTest.tearDown() finished in 7 ms
2018-11-25 16:04:00,042 INFO  - TESTNG INVOKING CONFIGURATION: "Surefire test" - @BeforeMethod org.apache.brooklyn.core.sensor.http.HttpRequestSensorTest.setUp()
2018-11-25 16:04:00,043 INFO  - Added external config supplier named 'brooklyn-demo-sample': org.apache.brooklyn.core.config.external.InPlaceExternalConfigSupplier@5acb0942
2018-11-25 16:04:00,086 INFO  - TESTNG PASSED CONFIGURATION: "Surefire test" - @BeforeMethod org.apache.brooklyn.core.sensor.http.HttpRequestSensorTest.setUp() finished in 44 ms
2018-11-25 16:04:00,086 INFO  - TESTNG INVOKING: "Surefire test" - org.apache.brooklyn.core.sensor.http.HttpRequestSensorTest.testNonJson()
2018-11-25 16:04:00,099 INFO  - TESTNG PASSED: "Surefire test" - org.apache.brooklyn.core.sensor.http.HttpRequestSensorTest.testNonJson() finished in 13 ms
2018-11-25 16:04:00,099 INFO  - TESTNG INVOKING CONFIGURATION: "Surefire test" - @AfterMethod org.apache.brooklyn.core.sensor.http.HttpRequestSensorTest.tearDown()
2018-11-25 16:04:00,106 INFO  - TESTNG PASSED CONFIGURATION: "Surefire test" - @AfterMethod org.apache.brooklyn.core.sensor.http.HttpRequestSensorTest.tearDown() finished in 7 ms
2018-11-25 16:04:00,107 INFO  - TESTNG INVOKING CONFIGURATION: "Surefire test" - @BeforeMethod org.apache.brooklyn.core.sensor.http.HttpRequestSensorTest.setUp()
2018-11-25 16:04:00,108 INFO  - Added external config supplier named 'brooklyn-demo-sample': org.apache.brooklyn.core.config.external.InPlaceExternalConfigSupplier@11dcea0f
2018-11-25 16:04:00,153 INFO  - TESTNG PASSED CONFIGURATION: "Surefire test" - @BeforeMethod org.apache.brooklyn.core.sensor.http.HttpRequestSensorTest.setUp() finished in 46 ms
2018-11-25 16:04:00,153 INFO  - TESTNG INVOKING: "Surefire test" - org.apache.brooklyn.core.sensor.http.HttpRequestSensorTest.testPreemptiveBasicAuth()
2018-11-25 16:04:00,162 INFO  - TESTNG PASSED: "Surefire test" - org.apache.brooklyn.core.sensor.http.HttpRequestSensorTest.testPreemptiveBasicAuth() finished in 9 ms
2018-11-25 16:04:00,162 INFO  - TESTNG INVOKING CONFIGURATION: "Surefire test" - @AfterMethod org.apache.brooklyn.core.sensor.http.HttpRequestSensorTest.tearDown()
2018-11-25 16:04:00,168 INFO  - TESTNG PASSED CONFIGURATION: "Surefire test" - @AfterMethod org.apache.brooklyn.core.sensor.http.HttpRequestSensorTest.tearDown() finished in 6 ms
2018-11-25 16:04:00,169 INFO  - TESTNG INVOKING CONFIGURATION: "Surefire test" - @BeforeMethod org.apache.brooklyn.core.test.BrooklynAppUnitTestSupport.setUp()
2018-11-25 16:04:00,169 INFO  - Added external config supplier named 'brooklyn-demo-sample': org.apache.brooklyn.core.config.external.InPlaceExternalConfigSupplier@6ba6d35a
2018-11-25 16:04:00,182 INFO  - TESTNG PASSED CONFIGURATION: "Surefire test" - @BeforeMethod org.apache.brooklyn.core.test.BrooklynAppUnitTestSupport.setUp() finished in 13 ms
2018-11-25 16:04:00,182 INFO  - TESTNG INVOKING: "Surefire test" - org.apache.brooklyn.core.sensor.MaxConcurrencySensorTest.testAddsStaticSensorOfTypeString()
2018-11-25 16:04:00,196 INFO  - TESTNG PASSED: "Surefire test" - org.apache.brooklyn.core.sensor.MaxConcurrencySensorTest.testAddsStaticSensorOfTypeString() finished in 14 ms
2018-11-25 16:04:00,196 INFO  - TESTNG INVOKING CONFIGURATION: "Surefire test" - @AfterMethod org.apache.brooklyn.core.test.BrooklynMgmtUnitTestSupport.tearDown()
2018-11-25 16:04:00,200 INFO  - TESTNG PASSED CONFIGURATION: "Surefire test" - @AfterMethod org.apache.brooklyn.core.test.BrooklynMgmtUnitTestSupport.tearDown() finished in 4 ms
2018-11-25 16:04:00,200 INFO  - TESTNG INVOKING CONFIGURATION: "Surefire test" - @BeforeMethod org.apache.brooklyn.core.test.BrooklynAppUnitTestSupport.setUp()
2018-11-25 16:04:00,201 INFO  - Added external config supplier named 'brooklyn-demo-sample': org.apache.brooklyn.core.config.external.InPlaceExternalConfigSupplier@2e2c5250
2018-11-25 16:04:00,210 INFO  - TESTNG PASSED CONFIGURATION: "Surefire test" - @BeforeMethod org.apache.brooklyn.core.test.BrooklynAppUnitTestSupport.setUp() finished in 10 ms
2018-11-25 16:04:00,210 INFO  - TESTNG INVOKING: "Surefire test" - org.apache.brooklyn.core.sensor.SensorEventPredicatesTest.testSensorEqualTo()
2018-11-25 16:04:00,211 INFO  - TESTNG PASSED: "Surefire test" - org.apache.brooklyn.core.sensor.SensorEventPredicatesTest.testSensorEqualTo() finished in 1 ms
2018-11-25 16:04:00,211 INFO  - TESTNG INVOKING CONFIGURATION: "Surefire test" - @AfterMethod org.apache.brooklyn.core.test.BrooklynMgmtUnitTestSupport.tearDown()
2018-11-25 16:04:00,215 INFO  - TESTNG PASSED CONFIGURATION: "Surefire test" - @AfterMethod org.apache.brooklyn.core.test.BrooklynMgmtUnitTestSupport.tearDown() finished in 4 ms
2018-11-25 16:04:00,215 INFO  - TESTNG INVOKING CONFIGURATION: "Surefire test" - @BeforeMethod org.apache.brooklyn.core.test.BrooklynAppUnitTestSupport.setUp()
2018-11-25 16:04:00,216 INFO  - Added external config supplier named 'brooklyn-demo-sample': org.apache.brooklyn.core.config.external.InPlaceExternalConfigSupplier@522b4e52
2018-11-25 16:04:00,225 INFO  - TESTNG PASSED CONFIGURATION: "Surefire test" - @BeforeMethod org.apache.brooklyn.core.test.BrooklynAppUnitTestSupport.setUp() finished in 10 ms
2018-11-25 16:04:00,225 INFO  - TESTNG INVOKING: "Surefire test" - org.apache.brooklyn.core.sensor.SensorEventPredicatesTest.testSensorSatisfies()
2018-11-25 16:04:00,225 INFO  - TESTNG PASSED: "Surefire test" - org.apache.brooklyn.core.sensor.SensorEventPredicatesTest.testSensorSatisfies() finished in 0 ms
2018-11-25 16:04:00,225 INFO  - TESTNG INVOKING CONFIGURATION: "Surefire test" - @AfterMethod org.apache.brooklyn.core.test.BrooklynMgmtUnitTestSupport.tearDown()
2018-11-25 16:04:00,228 INFO  - TESTNG PASSED CONFIGURATION: "Surefire test" - @AfterMethod org.apache.brooklyn.core.test.BrooklynMgmtUnitTestSupport.tearDown() finished in 3 ms
2018-11-25 16:04:00,228 INFO  - TESTNG INVOKING CONFIGURATION: "Surefire test" - @BeforeMethod org.apache.brooklyn.core.test.BrooklynAppUnitTestSupport.setUp()
2018-11-25 16:04:00,229 INFO  - Added external config supplier named 'brooklyn-demo-sample': org.apache.brooklyn.core.config.external.InPlaceExternalConfigSupplier@372879bf
2018-11-25 16:04:00,237 INFO  - TESTNG PASSED CONFIGURATION: "Surefire test" - @BeforeMethod org.apache.brooklyn.core.test.BrooklynAppUnitTestSupport.setUp() finished in 9 ms
2018-11-25 16:04:00,237 INFO  - TESTNG INVOKING: "Surefire test" - org.apache.brooklyn.core.sensor.SensorEventPredicatesTest.testValueEqualTo()
2018-11-25 16:04:00,238 INFO  - TESTNG PASSED: "Surefire test" - org.apache.brooklyn.core.sensor.SensorEventPredicatesTest.testValueEqualTo() finished in 1 ms
2018-11-25 16:04:00,238 INFO  - TESTNG INVOKING CONFIGURATION: "Surefire test" - @AfterMethod org.apache.brooklyn.core.test.BrooklynMgmtUnitTestSupport.tearDown()
2018-11-25 16:04:00,241 INFO  - TESTNG PASSED CONFIGURATION: "Surefire test" - @AfterMethod org.apache.brooklyn.core.test.BrooklynMgmtUnitTestSupport.tearDown() finished in 3 ms
2018-11-25 16:04:00,241 INFO  - TESTNG INVOKING CONFIGURATION: "Surefire test" - @BeforeMethod org.apache.brooklyn.core.test.BrooklynAppUnitTestSupport.setUp()
2018-11-25 16:04:00,241 INFO  - Added external config supplier named 'brooklyn-demo-sample': org.apache.brooklyn.core.config.external.InPlaceExternalConfigSupplier@1076094c
2018-11-25 16:04:00,251 INFO  - TESTNG PASSED CONFIGURATION: "Surefire test" - @BeforeMethod org.apache.brooklyn.core.test.BrooklynAppUnitTestSupport.setUp() finished in 10 ms
2018-11-25 16:04:00,251 INFO  - TESTNG INVOKING: "Surefire test" - org.apache.brooklyn.core.sensor.SensorEventPredicatesTest.testValueSatisfies()
2018-11-25 16:04:00,251 INFO  - TESTNG PASSED: "Surefire test" - org.apache.brooklyn.core.sensor.SensorEventPredicatesTest.testValueSatisfies() finished in 0 ms
2018-11-25 16:04:00,251 INFO  - TESTNG INVOKING CONFIGURATION: "Surefire test" - @AfterMethod org.apache.brooklyn.core.test.BrooklynMgmtUnitTestSupport.tearDown()
2018-11-25 16:04:00,254 INFO  - TESTNG PASSED CONFIGURATION: "Surefire test" - @AfterMethod org.apache.brooklyn.core.test.BrooklynMgmtUnitTestSupport.tearDown() finished in 3 ms
2018-11-25 16:04:00,472 INFO  - TESTNG 
===============================================
    Surefire test
    Tests run: 2348, Failures: 1, Skips: 0
===============================================
[GC (Allocation Failure)  403987K->180659K(768000K), 0.0335148 secs]
[GC (Allocation Failure)  405427K->175323K(767488K), 0.0125651 secs]
[GC (Allocation Failure)  400091K->175232K(768000K), 0.0231453 secs]
[GC (Allocation Failure)  400512K->175434K(768000K), 0.0084329 secs]
[GC (Allocation Failure)  400714K->175195K(768512K), 0.0062811 secs]
[GC (Allocation Failure)  401499K->179835K(768512K), 0.0121700 secs]
Tests run: 2348, Failures: 1, Errors: 0, Skipped: 0, Time elapsed: 209.959 sec <<< FAILURE! - in TestSuite
testUnsubmittedTaskWithExecutionContextTimesOutWhenImmediate(org.apache.brooklyn.util.core.task.ValueResolverTest)  Time elapsed: 0.013 sec  <<< FAILURE!
java.lang.AssertionError: result=Absent[] expected [true] but found [false]
	at org.apache.brooklyn.util.core.task.ValueResolverTest.testUnsubmittedTaskWithExecutionContextTimesOutWhenImmediate(ValueResolverTest.java:159)

2018-11-25 16:04:03,683 INFO  - Brooklyn shutdown: stopping entities [TestEntityImpl{id=bjn7qljdli}, TestEntityImpl{id=oaz7wiq2mu}, BlockingEntityImpl{id=i72a3ry9y2}]

Results :

Failed tests: 
  ValueResolverTest.testUnsubmittedTaskWithExecutionContextTimesOutWhenImmediate:159 result=Absent[] expected [true] but found [false]

Tests run: 2348, Failures: 1, Errors: 0, Skipped: 0

[INFO] ------------------------------------------------------------------------
[INFO] Reactor Summary:
[INFO] 
[INFO] Brooklyn Server Root ............................... SUCCESS [  4.716 s]
[INFO] Brooklyn Parent Project ............................ SUCCESS [  5.549 s]
[INFO] Brooklyn Test Support Utilities .................... SUCCESS [  8.407 s]
[INFO] Brooklyn Logback Includable Configuration .......... SUCCESS [  0.477 s]
[INFO] Brooklyn Common Utilities .......................... SUCCESS [ 28.710 s]
[INFO] Brooklyn API ....................................... SUCCESS [  3.608 s]
[INFO] CAMP Server Parent Project ......................... SUCCESS [  0.128 s]
[INFO] CAMP Base .......................................... SUCCESS [  3.845 s]
[INFO] Brooklyn Test Support .............................. SUCCESS [  2.444 s]
[INFO] Brooklyn REST Swagger Apidoc Utilities ............. SUCCESS [ 14.435 s]
[INFO] Brooklyn Logback Configuration ..................... SUCCESS [  0.198 s]
[INFO] CAMP Server ........................................ SUCCESS [ 13.857 s]
[INFO] Brooklyn Felix Runtime ............................. SUCCESS [  3.517 s]
[INFO] Brooklyn Groovy Utilities .......................... SUCCESS [  2.226 s]
[INFO] Brooklyn Core ...................................... FAILURE [04:21 min]
[INFO] Brooklyn Policies .................................. SKIPPED
[INFO] Brooklyn WinRM Software Entities ................... SKIPPED
[INFO] Brooklyn Secure JMXMP Agent ........................ SKIPPED
[INFO] Brooklyn JMX RMI Agent ............................. SKIPPED
[INFO] Brooklyn Jclouds Location Targets .................. SKIPPED
[INFO] Brooklyn Software Base ............................. SKIPPED
[INFO] Brooklyn CAMP ...................................... SKIPPED
[INFO] Brooklyn Launcher Common ........................... SKIPPED
[INFO] Brooklyn REST API .................................. SKIPPED
[INFO] Brooklyn REST Resources ............................ SKIPPED
[INFO] Brooklyn REST Server ............................... SKIPPED
[INFO] Brooklyn Launcher .................................. SKIPPED
[INFO] Brooklyn Container Location Targets ................ SKIPPED
[INFO] Brooklyn Command Line Interface .................... SKIPPED
[INFO] Brooklyn Test Framework ............................ SKIPPED
[INFO] Brooklyn OSGi init ................................. SKIPPED
[INFO] Brooklyn OSGi start ................................ SKIPPED
[INFO] Brooklyn Karaf ..................................... SKIPPED
[INFO] Jetty config fragment .............................. SKIPPED
[INFO] Apache Http Component extension .................... SKIPPED
[INFO] Brooklyn Karaf Features ............................ SKIPPED
[INFO] Brooklyn Karaf Shell Commands ...................... SKIPPED
[INFO] Brooklyn UI :: Parent .............................. SKIPPED
[INFO] Brooklyn UI :: Modularity Server (parent) .......... SKIPPED
[INFO] Brooklyn UI :: Modularity Server :: UI Module API .. SKIPPED
[INFO] Brooklyn UI :: Modularity Server :: UI Module Registry SKIPPED
[INFO] Brooklyn UI :: Modularity Server :: UI Proxy ....... SKIPPED
[INFO] Brooklyn UI :: Modularity Server :: UI Metadata Registry SKIPPED
[INFO] Brooklyn UI :: Modularity Server :: External UI Modules Registration Hooks SKIPPED
[INFO] Brooklyn UI :: Modularity Server :: Features ....... SKIPPED
[INFO] Brooklyn UI :: Modules (parent) .................... SKIPPED
[INFO] Brooklyn UI :: Modules - UI Utils .................. SKIPPED
[INFO] Brooklyn UI :: Modules - Home ...................... SKIPPED
[INFO] Brooklyn UI :: Modules - App inspector ............. SKIPPED
[INFO] Brooklyn UI :: Modules - Blueprint composer ........ SKIPPED
[INFO] Brooklyn UI :: Modules - Blueprint importer ........ SKIPPED
[INFO] Brooklyn UI :: Modules - Catalog ................... SKIPPED
[INFO] Brooklyn UI :: Modules - Location manager .......... SKIPPED
[INFO] Brooklyn UI :: Modules - REST API Docs ............. SKIPPED
[INFO] Brooklyn UI :: Modules - Groovy console ............ SKIPPED
[INFO] Brooklyn UI :: Modules - Logout .................... SKIPPED
[INFO] Brooklyn UI :: Modules - Features .................. SKIPPED
[INFO] Brooklyn UI :: Features ............................ SKIPPED
[INFO] Brooklyn Library Root .............................. SKIPPED
[INFO] Brooklyn CM Chef ................................... SKIPPED
[INFO] Brooklyn CM SaltStack .............................. SKIPPED
[INFO] Brooklyn CM Ansible ................................ SKIPPED
[INFO] Brooklyn CM Integration Root ....................... SKIPPED
[INFO] Brooklyn Network Software Entities ................. SKIPPED
[INFO] Brooklyn OSGi Software Entities .................... SKIPPED
[INFO] Brooklyn Database Software Entities ................ SKIPPED
[INFO] Brooklyn Web App Software Entities ................. SKIPPED
[INFO] Brooklyn Messaging Software Entities ............... SKIPPED
[INFO] Brooklyn NoSQL Data Store Software Entities ........ SKIPPED
[INFO] Brooklyn Monitoring Software Entities .............. SKIPPED
[INFO] Brooklyn Web App Software Entities ................. SKIPPED
[INFO] Brooklyn QA ........................................ SKIPPED
[INFO] Brooklyn Examples Aggregator Project ............... SKIPPED
[INFO] Brooklyn Examples Aggregator Project - Webapps ..... SKIPPED
[INFO] hello-world-webapp Maven Webapp .................... SKIPPED
[INFO] hello-world-sql-webapp Maven Webapp ................ SKIPPED
[INFO] Brooklyn Simple Web Cluster Example ................ SKIPPED
[INFO] Brooklyn Library Karaf integration ................. SKIPPED
[INFO] Brooklyn Library Catalog ........................... SKIPPED
[INFO] Brooklyn Library Karaf Features .................... SKIPPED
[INFO] Brooklyn Client .................................... SKIPPED
[INFO] Brooklyn Client Command Line Interface ............. SKIPPED
[INFO] Brooklyn REST java Client .......................... SKIPPED
[INFO] Brooklyn Downstream Project Parent ................. SKIPPED
[INFO] Brooklyn Dist Root ................................. SKIPPED
[INFO] Brooklyn All Things ................................ SKIPPED
[INFO] Brooklyn Distribution .............................. SKIPPED
[INFO] Brooklyn Karaf Distribution Parent ................. SKIPPED
[INFO] Brooklyn Karaf Server Configuration ................ SKIPPED
[INFO] Brooklyn Dist Karaf Features ....................... SKIPPED
[INFO] Brooklyn Karaf Distribution ........................ SKIPPED
[INFO] Brooklyn Karaf pax-exam itest ...................... SKIPPED
[INFO] Brooklyn Vagrant Getting Started Environment ....... SKIPPED
[INFO] Brooklyn Quick-Start Project Archetype ............. SKIPPED
[INFO] Brooklyn Shared Package Files ...................... SKIPPED
[INFO] Brooklyn RPM Package ............................... SKIPPED
[INFO] Brooklyn DEB Package ............................... SKIPPED
[INFO] Brooklyn Root 1.0.0-SNAPSHOT ....................... SKIPPED
[INFO] ------------------------------------------------------------------------
[INFO] BUILD FAILURE
[INFO] ------------------------------------------------------------------------
[INFO] Total time: 06:17 min
[INFO] Finished at: 2018-11-25T16:04:04Z
[INFO] ------------------------------------------------------------------------
[ERROR] Failed to execute goal org.apache.maven.plugins:maven-surefire-plugin:2.19.1:test (default-test) on project brooklyn-core: There are test failures.
[ERROR] 
[ERROR] Please refer to /usr/build/brooklyn-server/core/target/surefire-reports for the individual test results.
[ERROR] -> [Help 1]
[ERROR] 
[ERROR] To see the full stack trace of the errors, re-run Maven with the -e switch.
[ERROR] Re-run Maven using the -X switch to enable full debug logging.
[ERROR] 
[ERROR] For more information about the errors and possible solutions, please read the following articles:
[ERROR] [Help 1] http://cwiki.apache.org/confluence/display/MAVEN/MojoFailureException
[ERROR] 
[ERROR] After correcting the problems, you can resume the build with the command
[ERROR]   mvn <goals> -rf :brooklyn-core
Build step 'Execute shell' marked build as failure
Recording test results
TestNG Reports Processing: START
Looking for TestNG results report in workspace using pattern: **/testng-results.xml
Saving reports...
Processing '/x1/jenkins/jenkins-home/jobs/brooklyn-master-build-docker/builds/1053/testng/testng-results-1.xml'
Processing '/x1/jenkins/jenkins-home/jobs/brooklyn-master-build-docker/builds/1053/testng/testng-results-2.xml'
Processing '/x1/jenkins/jenkins-home/jobs/brooklyn-master-build-docker/builds/1053/testng/testng-results-3.xml'
Processing '/x1/jenkins/jenkins-home/jobs/brooklyn-master-build-docker/builds/1053/testng/testng-results-4.xml'
Processing '/x1/jenkins/jenkins-home/jobs/brooklyn-master-build-docker/builds/1053/testng/testng-results-5.xml'
Processing '/x1/jenkins/jenkins-home/jobs/brooklyn-master-build-docker/builds/1053/testng/testng-results-6.xml'
Processing '/x1/jenkins/jenkins-home/jobs/brooklyn-master-build-docker/builds/1053/testng/testng-results.xml'
0.033807% of tests failed, which exceeded threshold of 0%. Marking build as UNSTABLE
TestNG Reports Processing: FINISH