git.net

[Date Prev][Date Next][Thread Prev][Thread Next][Date Index][Thread Index]

Build failed in Jenkins: brooklyn-dist-master-docker #135


See <https://builds.apache.org/job/brooklyn-dist-master-docker/135/display/redirect>

------------------------------------------
[...truncated 4.45 MB...]
[INFO]           Transformer{uniqueTag=service.isUp if no service.notUp.indicators, running=true, entity=TestEffectorImpl{id=dr4pklocd4}, id=u6rsblra55}
[INFO]               enricher.sourceSensor[ConfigKey:org.apache.brooklyn.api.sensor.Sensor<?>] = Sensor: service.notUp.indicators (java.util.Map)
[INFO]               enricher.suppressDuplicates[ConfigKey:java.lang.Boolean] = true
[INFO]               enricher.targetSensor[ConfigKey:org.apache.brooklyn.api.sensor.Sensor<?>] = Sensor: service.isUp (java.lang.Boolean)
[INFO]               enricher.transformation[ConfigKey:com.google.common.base.Function<?, ?>] = if[{Predicates.not(Predicates.isNull())=forPredicate(Predicates.equalTo(0)(sizeFunction(keys)))}]-else[UNCHANGED]
[INFO]           ComputeServiceState{uniqueTag=service.state.actual, running=true, entity=TestEffectorImpl{id=dr4pklocd4}, id=qukvoguczd}
[INFO]     TestSensorImpl{id=tbb22w2hko} tbb22w2hko
[INFO]         displayName = TestSensor:tbb2
[INFO]         locations = []
[INFO]         assert = {equalTo=myEffector(myVal)}
[INFO]         sensor = lastCall
[INFO]         targetId = sample
[INFO]         application.id: p9w4p4bieh
[INFO]         entity.id: tbb22w2hko
[INFO]         service.isUp: true
[INFO]         service.state: running
[INFO]         service.state.expected: running @ 1542988311708 / Fri Nov 23 15:51:51 GMT 2018
[INFO]         target: MySampleImpl{id=rgf1u57xyj}
[INFO]         test.target.entity.id: rgf1u57xyj
[INFO]         test.target.entity.name: MySample:rgf1
[INFO]         test.target.entity.type: com.acme.sample.brooklyn.MySample
[INFO]         Enrichers:
[INFO]           Transformer{uniqueTag=service.isUp if no service.notUp.indicators, running=true, entity=TestSensorImpl{id=tbb22w2hko}, id=y54y2j5hys}
[INFO]               enricher.sourceSensor[ConfigKey:org.apache.brooklyn.api.sensor.Sensor<?>] = Sensor: service.notUp.indicators (java.util.Map)
[INFO]               enricher.suppressDuplicates[ConfigKey:java.lang.Boolean] = true
[INFO]               enricher.targetSensor[ConfigKey:org.apache.brooklyn.api.sensor.Sensor<?>] = Sensor: service.isUp (java.lang.Boolean)
[INFO]               enricher.transformation[ConfigKey:com.google.common.base.Function<?, ?>] = if[{Predicates.not(Predicates.isNull())=forPredicate(Predicates.equalTo(0)(sizeFunction(keys)))}]-else[UNCHANGED]
[INFO]           ComputeServiceState{uniqueTag=service.state.actual, running=true, entity=TestSensorImpl{id=tbb22w2hko}, id=hgr0olttoh}
[INFO]     TestEffectorImpl{id=rzcekeya7b} rzcekeya7b
[INFO]         displayName = TestEffector:rzce
[INFO]         locations = []
[INFO]         effector = stop
[INFO]         targetId = sample
[INFO]         application.id: p9w4p4bieh
[INFO]         entity.id: rzcekeya7b
[INFO]         service.isUp: true
[INFO]         service.state: running
[INFO]         service.state.expected: running @ 1542988311716 / Fri Nov 23 15:51:51 GMT 2018
[INFO]         target: MySampleImpl{id=rgf1u57xyj}
[INFO]         test.target.entity.id: rgf1u57xyj
[INFO]         test.target.entity.name: MySample:rgf1
[INFO]         test.target.entity.type: com.acme.sample.brooklyn.MySample
[INFO]         Enrichers:
[INFO]           Transformer{uniqueTag=service.isUp if no service.notUp.indicators, running=true, entity=TestEffectorImpl{id=rzcekeya7b}, id=d179ta2y50}
[INFO]               enricher.sourceSensor[ConfigKey:org.apache.brooklyn.api.sensor.Sensor<?>] = Sensor: service.notUp.indicators (java.util.Map)
[INFO]               enricher.suppressDuplicates[ConfigKey:java.lang.Boolean] = true
[INFO]               enricher.targetSensor[ConfigKey:org.apache.brooklyn.api.sensor.Sensor<?>] = Sensor: service.isUp (java.lang.Boolean)
[INFO]               enricher.transformation[ConfigKey:com.google.common.base.Function<?, ?>] = if[{Predicates.not(Predicates.isNull())=forPredicate(Predicates.equalTo(0)(sizeFunction(keys)))}]-else[UNCHANGED]
[INFO]           ComputeServiceState{uniqueTag=service.state.actual, running=true, entity=TestEffectorImpl{id=rzcekeya7b}, id=jww339x06x}
[INFO]     TestSensorImpl{id=itxhvdohjw} itxhvdohjw
[INFO]         displayName = TestSensor:itxh
[INFO]         locations = []
[INFO]         assert = {equalTo=false}
[INFO]         sensor = service.isUp
[INFO]         targetId = sample
[INFO]         timeout = 10s
[INFO]         application.id: p9w4p4bieh
[INFO]         entity.id: itxhvdohjw
[INFO]         service.isUp: true
[INFO]         service.state: running
[INFO]         service.state.expected: running @ 1542988311723 / Fri Nov 23 15:51:51 GMT 2018
[INFO]         target: MySampleImpl{id=rgf1u57xyj}
[INFO]         test.target.entity.id: rgf1u57xyj
[INFO]         test.target.entity.name: MySample:rgf1
[INFO]         test.target.entity.type: com.acme.sample.brooklyn.MySample
[INFO]         Enrichers:
[INFO]           Transformer{uniqueTag=service.isUp if no service.notUp.indicators, running=true, entity=TestSensorImpl{id=itxhvdohjw}, id=r6i1lgit9v}
[INFO]               enricher.sourceSensor[ConfigKey:org.apache.brooklyn.api.sensor.Sensor<?>] = Sensor: service.notUp.indicators (java.util.Map)
[INFO]               enricher.suppressDuplicates[ConfigKey:java.lang.Boolean] = true
[INFO]               enricher.targetSensor[ConfigKey:org.apache.brooklyn.api.sensor.Sensor<?>] = Sensor: service.isUp (java.lang.Boolean)
[INFO]               enricher.transformation[ConfigKey:com.google.common.base.Function<?, ?>] = if[{Predicates.not(Predicates.isNull())=forPredicate(Predicates.equalTo(0)(sizeFunction(keys)))}]-else[UNCHANGED]
[INFO]           ComputeServiceState{uniqueTag=service.state.actual, running=true, entity=TestSensorImpl{id=itxhvdohjw}, id=si9qvixzbe}
[INFO] 2018-11-23 15:51:51,774 INFO  - TESTNG PASSED: "Surefire test" - com.acme.sample.brooklyn.MySampleYamlTest.testUsingTestFramework() finished in 406 ms
[INFO] 2018-11-23 15:51:51,776 INFO  - TESTNG INVOKING CONFIGURATION: "Surefire test" - @AfterMethod org.apache.brooklyn.camp.brooklyn.AbstractYamlTest.tearDown()
[INFO] 2018-11-23 15:51:51,779 INFO  iuefvyLr-[p9w4p4bieh] Stopping application BasicApplicationImpl{id=p9w4p4bieh}
[INFO] 2018-11-23 15:51:51,783 INFO  UYgMquRB-[p9w4p4bieh,rgf1u57xyj] MySampleImpl.stop()
[INFO] 2018-11-23 15:51:51,799 INFO  iuefvyLr-[p9w4p4bieh] Stopped application BasicApplicationImpl{id=p9w4p4bieh}
[INFO] 2018-11-23 15:51:51,825 INFO  - TESTNG PASSED CONFIGURATION: "Surefire test" - @AfterMethod org.apache.brooklyn.camp.brooklyn.AbstractYamlTest.tearDown() finished in 50 ms
[INFO] 2018-11-23 15:51:51,827 INFO  - TESTNG INVOKING CONFIGURATION: "Surefire test" - @BeforeMethod org.apache.brooklyn.core.test.BrooklynAppUnitTestSupport.setUp()
[INFO] 2018-11-23 15:51:51,828 INFO  - Added external config supplier named 'brooklyn-demo-sample': org.apache.brooklyn.core.config.external.InPlaceExternalConfigSupplier@5851bd4f
[INFO] 2018-11-23 15:51:51,871 INFO  - TESTNG PASSED CONFIGURATION: "Surefire test" - @BeforeMethod org.apache.brooklyn.core.test.BrooklynAppUnitTestSupport.setUp() finished in 44 ms
[INFO] 2018-11-23 15:51:51,872 INFO  - TESTNG INVOKING: "Surefire test" - com.acme.sample.brooklyn.MySampleTest.testEntity()
[INFO] 2018-11-23 15:51:51,885 INFO  - MySampleImpl.init() with config myConfVal
[INFO] 2018-11-23 15:51:51,891 INFO  G4od1qzD-[bbx6cw4bzz,g3iubds317] MySampleImpl.start([])
[INFO] 2018-11-23 15:51:51,908 INFO  XRDQRKGw-[bbx6cw4bzz,g3iubds317] MySampleImpl.myEffector(myArgVal)
[INFO] 2018-11-23 15:51:51,912 INFO  jsqTtshW-[bbx6cw4bzz,g3iubds317] MySampleImpl.stop()
[INFO] 2018-11-23 15:52:21,919 INFO  - succeedsEventually exceeded max attempts or timeout - 75 attempts lasting 30000 ms, for RunnableAdapter(org.apache.brooklyn.core.entity.EntityAsserts$1@70f43b45)
[INFO] 2018-11-23 15:52:21,919 INFO  - failed succeeds-eventually, 75 attempts, 30001ms elapsed (rethrowing): java.lang.AssertionError: entity=MySampleImpl{id=g3iubds317}; attribute=Sensor: service.isUp (java.lang.Boolean) expected [false] but found [true]
[INFO] 2018-11-23 15:52:21,925 INFO  - TESTNG FAILED: "Surefire test" - com.acme.sample.brooklyn.MySampleTest.testEntity() finished in 30049 ms
[INFO] java.lang.AssertionError: failed succeeds-eventually, 75 attempts, 30001ms elapsed: AssertionError: entity=MySampleImpl{id=g3iubds317}; attribute=Sensor: service.isUp (java.lang.Boolean) expected [false] but found [true]
[INFO] 	at org.apache.brooklyn.test.Asserts.succeedsEventually(Asserts.java:1009)
[INFO] 	at org.apache.brooklyn.test.Asserts.succeedsEventually(Asserts.java:892)
[INFO] 	at org.apache.brooklyn.core.entity.EntityAsserts.assertAttributeEqualsEventually(EntityAsserts.java:71)
[INFO] 	at org.apache.brooklyn.core.entity.EntityAsserts.assertAttributeEqualsEventually(EntityAsserts.java:66)
[INFO] 	at com.acme.sample.brooklyn.MySampleTest.testEntity(MySampleTest.java:33)
[INFO] Caused by: java.lang.AssertionError: entity=MySampleImpl{id=g3iubds317}; attribute=Sensor: service.isUp (java.lang.Boolean) expected [false] but found [true]
[INFO] 	at org.apache.brooklyn.test.Asserts.fail(Asserts.java:755)
[INFO] 	at org.apache.brooklyn.test.Asserts.failNotEquals(Asserts.java:145)
[INFO] 	at org.apache.brooklyn.test.Asserts.assertEquals(Asserts.java:467)
[INFO] 	at org.apache.brooklyn.core.entity.EntityAsserts.assertAttributeEquals(EntityAsserts.java:58)
[INFO] 	at org.apache.brooklyn.core.entity.EntityAsserts$1.run(EntityAsserts.java:74)
[INFO] 	at org.apache.brooklyn.test.Asserts$RunnableAdapter.call(Asserts.java:1367)
[INFO] 	at org.apache.brooklyn.test.Asserts.succeedsEventually(Asserts.java:970)
[INFO] 	... 33 more
[INFO] 2018-11-23 15:52:21,931 INFO  - TESTNG INVOKING CONFIGURATION: "Surefire test" - @AfterMethod org.apache.brooklyn.core.test.BrooklynMgmtUnitTestSupport.tearDown()
[INFO] 2018-11-23 15:52:21,939 INFO  - TESTNG PASSED CONFIGURATION: "Surefire test" - @AfterMethod org.apache.brooklyn.core.test.BrooklynMgmtUnitTestSupport.tearDown() finished in 8 ms
[INFO] 2018-11-23 15:52:21,958 INFO  - TESTNG 
[INFO] ===============================================
[INFO]     Surefire test
[INFO]     Tests run: 3, Failures: 1, Skips: 0
[INFO] ===============================================
[INFO] Tests run: 3, Failures: 1, Errors: 0, Skipped: 0, Time elapsed: 33.555 sec <<< FAILURE! - in TestSuite
[INFO] testEntity(com.acme.sample.brooklyn.MySampleTest)  Time elapsed: 30.06 sec  <<< FAILURE!
[INFO] java.lang.AssertionError: failed succeeds-eventually, 75 attempts, 30001ms elapsed: AssertionError: entity=MySampleImpl{id=g3iubds317}; attribute=Sensor: service.isUp (java.lang.Boolean) expected [false] but found [true]
[INFO] 	at org.apache.brooklyn.test.Asserts.fail(Asserts.java:755)
[INFO] 	at org.apache.brooklyn.test.Asserts.failNotEquals(Asserts.java:145)
[INFO] 	at org.apache.brooklyn.test.Asserts.assertEquals(Asserts.java:467)
[INFO] 	at org.apache.brooklyn.core.entity.EntityAsserts.assertAttributeEquals(EntityAsserts.java:58)
[INFO] 	at org.apache.brooklyn.core.entity.EntityAsserts$1.run(EntityAsserts.java:74)
[INFO] 	at org.apache.brooklyn.test.Asserts$RunnableAdapter.call(Asserts.java:1367)
[INFO] 	at org.apache.brooklyn.test.Asserts.succeedsEventually(Asserts.java:970)
[INFO] 	at org.apache.brooklyn.test.Asserts.succeedsEventually(Asserts.java:892)
[INFO] 	at org.apache.brooklyn.core.entity.EntityAsserts.assertAttributeEqualsEventually(EntityAsserts.java:71)
[INFO] 	at org.apache.brooklyn.core.entity.EntityAsserts.assertAttributeEqualsEventually(EntityAsserts.java:66)
[INFO] 	at com.acme.sample.brooklyn.MySampleTest.testEntity(MySampleTest.java:33)
[INFO] 
[INFO] 
[INFO] Results :
[INFO] 
[INFO] Failed tests: 
[INFO]   MySampleTest.testEntity:33 failed succeeds-eventually, 75 attempts, 30001ms elapsed: AssertionError: entity=MySampleImpl{id=g3iubds317}; attribute=Sensor: service.isUp (java.lang.Boolean) expected [false] but found [true]
[INFO] 
[INFO] Tests run: 3, Failures: 1, Errors: 0, Skipped: 0
[INFO] 
[INFO] [INFO] ------------------------------------------------------------------------
[INFO] [INFO] BUILD FAILURE
[INFO] [INFO] ------------------------------------------------------------------------
[INFO] [INFO] Total time: 01:21 min
[INFO] [INFO] Finished at: 2018-11-23T15:52:22Z
[INFO] [INFO] Final Memory: 55M/618M
[INFO] [INFO] ------------------------------------------------------------------------
[INFO] [ERROR] Failed to execute goal org.apache.maven.plugins:maven-surefire-plugin:2.18.1:test (default-test) on project brooklyn-sample: There are test failures.
[INFO] [ERROR] 
[INFO] [ERROR] Please refer to /usr/build/archetypes/quickstart/target/test-classes/projects/integration-test-1/project/brooklyn-sample/target/surefire-reports for the individual test results.
[INFO] [ERROR] -> [Help 1]
[INFO] org.apache.maven.lifecycle.LifecycleExecutionException: Failed to execute goal org.apache.maven.plugins:maven-surefire-plugin:2.18.1:test (default-test) on project brooklyn-sample: There are test failures.
[INFO] 
[INFO] Please refer to /usr/build/archetypes/quickstart/target/test-classes/projects/integration-test-1/project/brooklyn-sample/target/surefire-reports for the individual test results.
[INFO]     at org.apache.maven.lifecycle.internal.MojoExecutor.execute (MojoExecutor.java:213)
[INFO]     at org.apache.maven.lifecycle.internal.MojoExecutor.execute (MojoExecutor.java:154)
[INFO]     at org.apache.maven.lifecycle.internal.MojoExecutor.execute (MojoExecutor.java:146)
[INFO]     at org.apache.maven.lifecycle.internal.LifecycleModuleBuilder.buildProject (LifecycleModuleBuilder.java:117)
[INFO]     at org.apache.maven.lifecycle.internal.LifecycleModuleBuilder.buildProject (LifecycleModuleBuilder.java:81)
[INFO]     at org.apache.maven.lifecycle.internal.builder.singlethreaded.SingleThreadedBuilder.build (SingleThreadedBuilder.java:51)
[INFO]     at org.apache.maven.lifecycle.internal.LifecycleStarter.execute (LifecycleStarter.java:128)
[INFO]     at org.apache.maven.DefaultMaven.doExecute (DefaultMaven.java:309)
[INFO]     at org.apache.maven.DefaultMaven.doExecute (DefaultMaven.java:194)
[INFO]     at org.apache.maven.DefaultMaven.execute (DefaultMaven.java:107)
[INFO]     at org.apache.maven.cli.MavenCli.execute (MavenCli.java:955)
[INFO]     at org.apache.maven.cli.MavenCli.doMain (MavenCli.java:290)
[INFO]     at org.apache.maven.cli.MavenCli.main (MavenCli.java:194)
[INFO]     at sun.reflect.NativeMethodAccessorImpl.invoke0 (Native Method)
[INFO]     at sun.reflect.NativeMethodAccessorImpl.invoke (NativeMethodAccessorImpl.java:62)
[INFO]     at sun.reflect.DelegatingMethodAccessorImpl.invoke (DelegatingMethodAccessorImpl.java:43)
[INFO]     at java.lang.reflect.Method.invoke (Method.java:498)
[INFO]     at org.codehaus.plexus.classworlds.launcher.Launcher.launchEnhanced (Launcher.java:289)
[INFO]     at org.codehaus.plexus.classworlds.launcher.Launcher.launch (Launcher.java:229)
[INFO]     at org.codehaus.plexus.classworlds.launcher.Launcher.mainWithExitCode (Launcher.java:415)
[INFO]     at org.codehaus.plexus.classworlds.launcher.Launcher.main (Launcher.java:356)
[INFO] Caused by: org.apache.maven.plugin.MojoFailureException: There are test failures.
[INFO] 
[INFO] Please refer to /usr/build/archetypes/quickstart/target/test-classes/projects/integration-test-1/project/brooklyn-sample/target/surefire-reports for the individual test results.
[INFO]     at org.apache.maven.plugin.surefire.SurefireHelper.reportExecution (SurefireHelper.java:82)
[INFO]     at org.apache.maven.plugin.surefire.SurefirePlugin.handleSummary (SurefirePlugin.java:254)
[INFO]     at org.apache.maven.plugin.surefire.AbstractSurefireMojo.executeAfterPreconditionsChecked (AbstractSurefireMojo.java:854)
[INFO]     at org.apache.maven.plugin.surefire.AbstractSurefireMojo.execute (AbstractSurefireMojo.java:722)
[INFO]     at org.apache.maven.plugin.DefaultBuildPluginManager.executeMojo (DefaultBuildPluginManager.java:134)
[INFO]     at org.apache.maven.lifecycle.internal.MojoExecutor.execute (MojoExecutor.java:208)
[INFO]     at org.apache.maven.lifecycle.internal.MojoExecutor.execute (MojoExecutor.java:154)
[INFO]     at org.apache.maven.lifecycle.internal.MojoExecutor.execute (MojoExecutor.java:146)
[INFO]     at org.apache.maven.lifecycle.internal.LifecycleModuleBuilder.buildProject (LifecycleModuleBuilder.java:117)
[INFO]     at org.apache.maven.lifecycle.internal.LifecycleModuleBuilder.buildProject (LifecycleModuleBuilder.java:81)
[INFO]     at org.apache.maven.lifecycle.internal.builder.singlethreaded.SingleThreadedBuilder.build (SingleThreadedBuilder.java:51)
[INFO]     at org.apache.maven.lifecycle.internal.LifecycleStarter.execute (LifecycleStarter.java:128)
[INFO]     at org.apache.maven.DefaultMaven.doExecute (DefaultMaven.java:309)
[INFO]     at org.apache.maven.DefaultMaven.doExecute (DefaultMaven.java:194)
[INFO]     at org.apache.maven.DefaultMaven.execute (DefaultMaven.java:107)
[INFO]     at org.apache.maven.cli.MavenCli.execute (MavenCli.java:955)
[INFO]     at org.apache.maven.cli.MavenCli.doMain (MavenCli.java:290)
[INFO]     at org.apache.maven.cli.MavenCli.main (MavenCli.java:194)
[INFO]     at sun.reflect.NativeMethodAccessorImpl.invoke0 (Native Method)
[INFO]     at sun.reflect.NativeMethodAccessorImpl.invoke (NativeMethodAccessorImpl.java:62)
[INFO]     at sun.reflect.DelegatingMethodAccessorImpl.invoke (DelegatingMethodAccessorImpl.java:43)
[INFO]     at java.lang.reflect.Method.invoke (Method.java:498)
[INFO]     at org.codehaus.plexus.classworlds.launcher.Launcher.launchEnhanced (Launcher.java:289)
[INFO]     at org.codehaus.plexus.classworlds.launcher.Launcher.launch (Launcher.java:229)
[INFO]     at org.codehaus.plexus.classworlds.launcher.Launcher.mainWithExitCode (Launcher.java:415)
[INFO]     at org.codehaus.plexus.classworlds.launcher.Launcher.main (Launcher.java:356)
[INFO] [ERROR] 
[INFO] [ERROR] Re-run Maven using the -X switch to enable full debug logging.
[INFO] [ERROR] 
[INFO] [ERROR] For more information about the errors and possible solutions, please read the following articles:
[INFO] [ERROR] [Help 1] http://cwiki.apache.org/confluence/display/MAVEN/MojoFailureException
[INFO] Post-archetype-generation invoker exit code: 1
[INFO] ------------------------------------------------------------------------
[INFO] Reactor Summary:
[INFO] 
[INFO] Brooklyn Downstream Project Parent ................. SUCCESS [ 23.910 s]
[INFO] Brooklyn Dist Root ................................. SUCCESS [  8.233 s]
[INFO] Brooklyn All Things ................................ SUCCESS [02:19 min]
[INFO] Brooklyn Distribution .............................. SUCCESS [01:05 min]
[INFO] Brooklyn Karaf Distribution Parent ................. SUCCESS [  0.135 s]
[INFO] Brooklyn Karaf Server Configuration ................ SUCCESS [  1.642 s]
[INFO] Brooklyn Dist Karaf Features ....................... SUCCESS [  3.076 s]
[INFO] Brooklyn Karaf Distribution ........................ SUCCESS [02:19 min]
[INFO] Brooklyn Karaf pax-exam itest ...................... SUCCESS [02:54 min]
[INFO] Brooklyn Vagrant Getting Started Environment ....... SUCCESS [  0.204 s]
[INFO] Brooklyn Quick-Start Project Archetype ............. FAILURE [01:26 min]
[INFO] Brooklyn Shared Package Files ...................... SKIPPED
[INFO] Brooklyn RPM Package ............................... SKIPPED
[INFO] Brooklyn DEB Package ............................... SKIPPED
[INFO] ------------------------------------------------------------------------
[INFO] BUILD FAILURE
[INFO] ------------------------------------------------------------------------
[INFO] Total time: 11:09 min
[INFO] Finished at: 2018-11-23T15:52:22Z
[INFO] Final Memory: 106M/851M
[INFO] ------------------------------------------------------------------------
[ERROR] Failed to execute goal org.apache.maven.plugins:maven-archetype-plugin:2.3:integration-test (default-integration-test) on project brooklyn-archetype-quickstart: 
[ERROR] Archetype IT 'integration-test-1' failed: Execution failure: exit code = 1
[ERROR] -> [Help 1]
[ERROR] 
[ERROR] To see the full stack trace of the errors, re-run Maven with the -e switch.
[ERROR] Re-run Maven using the -X switch to enable full debug logging.
[ERROR] 
[ERROR] For more information about the errors and possible solutions, please read the following articles:
[ERROR] [Help 1] http://cwiki.apache.org/confluence/display/MAVEN/MojoExecutionException
[ERROR] 
[ERROR] After correcting the problems, you can resume the build with the command
[ERROR]   mvn <goals> -rf :brooklyn-archetype-quickstart
Build step 'Execute shell' marked build as failure
Recording test results
TestNG Reports Processing: START
Looking for TestNG results report in workspace using pattern: **/testng-results.xml
Saving reports...
Processing '/x1/jenkins/jenkins-home/jobs/brooklyn-dist-master-docker/builds/135/testng/testng-results-1.xml'
Processing '/x1/jenkins/jenkins-home/jobs/brooklyn-dist-master-docker/builds/135/testng/testng-results.xml'
33.333332% of tests failed, which exceeded threshold of 0%. Marking build as UNSTABLE
TestNG Reports Processing: FINISH