git.net

[Date Prev][Date Next][Thread Prev][Thread Next][Date Index][Thread Index]

Build failed in Jenkins: brooklyn-dist-master-docker #112


See <https://builds.apache.org/job/brooklyn-dist-master-docker/112/display/redirect>

------------------------------------------
[...truncated 4.98 MB...]
[INFO] brooklyn-client-cli-1.0.0-SNAPSHOT-bin.zip already unpacked.
[INFO] 
[INFO] --- maven-jar-plugin:2.6:jar (default-jar) @ brooklyn-dist ---
[INFO] Building jar: /usr/build/dist/target/brooklyn-dist-1.0.0-SNAPSHOT.jar
[INFO] 
[INFO] --- maven-site-plugin:3.4:attach-descriptor (attach-descriptor) @ brooklyn-dist ---
[INFO] 
[INFO] --- maven-jar-plugin:2.6:test-jar (test-jar-creation) @ brooklyn-dist ---
[INFO] Building jar: /usr/build/dist/target/brooklyn-dist-1.0.0-SNAPSHOT-tests.jar
[INFO] 
[INFO] --- maven-assembly-plugin:2.5.4:single (build-distribution-dir) @ brooklyn-dist ---
[INFO] Reading assembly descriptor: src/main/config/build-distribution.xml
[INFO] Copying files to /usr/build/dist/target/brooklyn-dist
[INFO] 
[INFO] --- maven-assembly-plugin:2.5.4:single (build-distribution-archive) @ brooklyn-dist ---
[INFO] Reading assembly descriptor: src/main/config/build-distribution.xml
[INFO] Building tar: /usr/build/dist/target/brooklyn-dist-1.0.0-SNAPSHOT-dist.tar.gz
[INFO] Building zip: /usr/build/dist/target/brooklyn-dist-1.0.0-SNAPSHOT-dist.zip
[INFO] 
[INFO] --- dockerfile-maven-plugin:1.4.0:build (default) @ brooklyn-dist ---
[INFO] Building Docker context /usr/build/dist
[INFO] 
[INFO] Image will be built as apache/brooklyn:1.0.0-SNAPSHOT
[INFO] 
Nov 04, 2018 9:53:44 AM com.spotify.docker.client.shaded.org.apache.http.impl.execchain.RetryExec execute
INFO: I/O exception (java.io.IOException) caught when processing request to {}->unix://localhost:80: No such file or directory
Nov 04, 2018 9:53:44 AM com.spotify.docker.client.shaded.org.apache.http.impl.execchain.RetryExec execute
INFO: Retrying request to {}->unix://localhost:80
Nov 04, 2018 9:53:44 AM com.spotify.docker.client.shaded.org.apache.http.impl.execchain.RetryExec execute
INFO: I/O exception (java.io.IOException) caught when processing request to {}->unix://localhost:80: No such file or directory
Nov 04, 2018 9:53:44 AM com.spotify.docker.client.shaded.org.apache.http.impl.execchain.RetryExec execute
INFO: Retrying request to {}->unix://localhost:80
Nov 04, 2018 9:53:44 AM com.spotify.docker.client.shaded.org.apache.http.impl.execchain.RetryExec execute
INFO: I/O exception (java.io.IOException) caught when processing request to {}->unix://localhost:80: No such file or directory
Nov 04, 2018 9:53:44 AM com.spotify.docker.client.shaded.org.apache.http.impl.execchain.RetryExec execute
INFO: Retrying request to {}->unix://localhost:80
[WARNING] An attempt failed, will retry 1 more times
org.apache.maven.plugin.MojoExecutionException: Could not build image
    at com.spotify.plugin.dockerfile.BuildMojo.buildImage (BuildMojo.java:185)
    at com.spotify.plugin.dockerfile.BuildMojo.execute (BuildMojo.java:105)
    at com.spotify.plugin.dockerfile.AbstractDockerMojo.tryExecute (AbstractDockerMojo.java:246)
    at com.spotify.plugin.dockerfile.AbstractDockerMojo.execute (AbstractDockerMojo.java:235)
    at org.apache.maven.plugin.DefaultBuildPluginManager.executeMojo (DefaultBuildPluginManager.java:134)
    at org.apache.maven.lifecycle.internal.MojoExecutor.execute (MojoExecutor.java:208)
    at org.apache.maven.lifecycle.internal.MojoExecutor.execute (MojoExecutor.java:154)
    at org.apache.maven.lifecycle.internal.MojoExecutor.execute (MojoExecutor.java:146)
    at org.apache.maven.lifecycle.internal.LifecycleModuleBuilder.buildProject (LifecycleModuleBuilder.java:117)
    at org.apache.maven.lifecycle.internal.LifecycleModuleBuilder.buildProject (LifecycleModuleBuilder.java:81)
    at org.apache.maven.lifecycle.internal.builder.singlethreaded.SingleThreadedBuilder.build (SingleThreadedBuilder.java:51)
    at org.apache.maven.lifecycle.internal.LifecycleStarter.execute (LifecycleStarter.java:128)
    at org.apache.maven.DefaultMaven.doExecute (DefaultMaven.java:309)
    at org.apache.maven.DefaultMaven.doExecute (DefaultMaven.java:194)
    at org.apache.maven.DefaultMaven.execute (DefaultMaven.java:107)
    at org.apache.maven.cli.MavenCli.execute (MavenCli.java:955)
    at org.apache.maven.cli.MavenCli.doMain (MavenCli.java:290)
    at org.apache.maven.cli.MavenCli.main (MavenCli.java:194)
    at sun.reflect.NativeMethodAccessorImpl.invoke0 (Native Method)
    at sun.reflect.NativeMethodAccessorImpl.invoke (NativeMethodAccessorImpl.java:62)
    at sun.reflect.DelegatingMethodAccessorImpl.invoke (DelegatingMethodAccessorImpl.java:43)
    at java.lang.reflect.Method.invoke (Method.java:498)
    at org.codehaus.plexus.classworlds.launcher.Launcher.launchEnhanced (Launcher.java:289)
    at org.codehaus.plexus.classworlds.launcher.Launcher.launch (Launcher.java:229)
    at org.codehaus.plexus.classworlds.launcher.Launcher.mainWithExitCode (Launcher.java:415)
    at org.codehaus.plexus.classworlds.launcher.Launcher.main (Launcher.java:356)
Caused by: com.spotify.docker.client.exceptions.DockerException: java.util.concurrent.ExecutionException: com.spotify.docker.client.shaded.javax.ws.rs.ProcessingException: java.io.IOException: No such file or directory
    at com.spotify.docker.client.DefaultDockerClient.propagate (DefaultDockerClient.java:2710)
    at com.spotify.docker.client.DefaultDockerClient.request (DefaultDockerClient.java:2641)
    at com.spotify.docker.client.DefaultDockerClient.version (DefaultDockerClient.java:517)
    at com.spotify.docker.client.DefaultDockerClient.authRegistryHeader (DefaultDockerClient.java:2753)
    at com.spotify.docker.client.DefaultDockerClient.build (DefaultDockerClient.java:1414)
    at com.spotify.docker.client.DefaultDockerClient.build (DefaultDockerClient.java:1383)
    at com.spotify.plugin.dockerfile.BuildMojo.buildImage (BuildMojo.java:178)
    at com.spotify.plugin.dockerfile.BuildMojo.execute (BuildMojo.java:105)
    at com.spotify.plugin.dockerfile.AbstractDockerMojo.tryExecute (AbstractDockerMojo.java:246)
    at com.spotify.plugin.dockerfile.AbstractDockerMojo.execute (AbstractDockerMojo.java:235)
    at org.apache.maven.plugin.DefaultBuildPluginManager.executeMojo (DefaultBuildPluginManager.java:134)
    at org.apache.maven.lifecycle.internal.MojoExecutor.execute (MojoExecutor.java:208)
    at org.apache.maven.lifecycle.internal.MojoExecutor.execute (MojoExecutor.java:154)
    at org.apache.maven.lifecycle.internal.MojoExecutor.execute (MojoExecutor.java:146)
    at org.apache.maven.lifecycle.internal.LifecycleModuleBuilder.buildProject (LifecycleModuleBuilder.java:117)
    at org.apache.maven.lifecycle.internal.LifecycleModuleBuilder.buildProject (LifecycleModuleBuilder.java:81)
    at org.apache.maven.lifecycle.internal.builder.singlethreaded.SingleThreadedBuilder.build (SingleThreadedBuilder.java:51)
    at org.apache.maven.lifecycle.internal.LifecycleStarter.execute (LifecycleStarter.java:128)
    at org.apache.maven.DefaultMaven.doExecute (DefaultMaven.java:309)
    at org.apache.maven.DefaultMaven.doExecute (DefaultMaven.java:194)
    at org.apache.maven.DefaultMaven.execute (DefaultMaven.java:107)
    at org.apache.maven.cli.MavenCli.execute (MavenCli.java:955)
    at org.apache.maven.cli.MavenCli.doMain (MavenCli.java:290)
    at org.apache.maven.cli.MavenCli.main (MavenCli.java:194)
    at sun.reflect.NativeMethodAccessorImpl.invoke0 (Native Method)
    at sun.reflect.NativeMethodAccessorImpl.invoke (NativeMethodAccessorImpl.java:62)
    at sun.reflect.DelegatingMethodAccessorImpl.invoke (DelegatingMethodAccessorImpl.java:43)
    at java.lang.reflect.Method.invoke (Method.java:498)
    at org.codehaus.plexus.classworlds.launcher.Launcher.launchEnhanced (Launcher.java:289)
    at org.codehaus.plexus.classworlds.launcher.Launcher.launch (Launcher.java:229)
    at org.codehaus.plexus.classworlds.launcher.Launcher.mainWithExitCode (Launcher.java:415)
    at org.codehaus.plexus.classworlds.launcher.Launcher.main (Launcher.java:356)
Caused by: java.util.concurrent.ExecutionException: com.spotify.docker.client.shaded.javax.ws.rs.ProcessingException: java.io.IOException: No such file or directory
    at jersey.repackaged.com.google.common.util.concurrent.AbstractFuture$Sync.getValue (AbstractFuture.java:299)
    at jersey.repackaged.com.google.common.util.concurrent.AbstractFuture$Sync.get (AbstractFuture.java:286)
    at jersey.repackaged.com.google.common.util.concurrent.AbstractFuture.get (AbstractFuture.java:116)
    at com.spotify.docker.client.DefaultDockerClient.request (DefaultDockerClient.java:2639)
    at com.spotify.docker.client.DefaultDockerClient.version (DefaultDockerClient.java:517)
    at com.spotify.docker.client.DefaultDockerClient.authRegistryHeader (DefaultDockerClient.java:2753)
    at com.spotify.docker.client.DefaultDockerClient.build (DefaultDockerClient.java:1414)
    at com.spotify.docker.client.DefaultDockerClient.build (DefaultDockerClient.java:1383)
    at com.spotify.plugin.dockerfile.BuildMojo.buildImage (BuildMojo.java:178)
    at com.spotify.plugin.dockerfile.BuildMojo.execute (BuildMojo.java:105)
    at com.spotify.plugin.dockerfile.AbstractDockerMojo.tryExecute (AbstractDockerMojo.java:246)
    at com.spotify.plugin.dockerfile.AbstractDockerMojo.execute (AbstractDockerMojo.java:235)
    at org.apache.maven.plugin.DefaultBuildPluginManager.executeMojo (DefaultBuildPluginManager.java:134)
    at org.apache.maven.lifecycle.internal.MojoExecutor.execute (MojoExecutor.java:208)
    at org.apache.maven.lifecycle.internal.MojoExecutor.execute (MojoExecutor.java:154)
    at org.apache.maven.lifecycle.internal.MojoExecutor.execute (MojoExecutor.java:146)
    at org.apache.maven.lifecycle.internal.LifecycleModuleBuilder.buildProject (LifecycleModuleBuilder.java:117)
    at org.apache.maven.lifecycle.internal.LifecycleModuleBuilder.buildProject (LifecycleModuleBuilder.java:81)
    at org.apache.maven.lifecycle.internal.builder.singlethreaded.SingleThreadedBuilder.build (SingleThreadedBuilder.java:51)
    at org.apache.maven.lifecycle.internal.LifecycleStarter.execute (LifecycleStarter.java:128)
    at org.apache.maven.DefaultMaven.doExecute (DefaultMaven.java:309)
    at org.apache.maven.DefaultMaven.doExecute (DefaultMaven.java:194)
    at org.apache.maven.DefaultMaven.execute (DefaultMaven.java:107)
    at org.apache.maven.cli.MavenCli.execute (MavenCli.java:955)
    at org.apache.maven.cli.MavenCli.doMain (MavenCli.java:290)
    at org.apache.maven.cli.MavenCli.main (MavenCli.java:194)
    at sun.reflect.NativeMethodAccessorImpl.invoke0 (Native Method)
    at sun.reflect.NativeMethodAccessorImpl.invoke (NativeMethodAccessorImpl.java:62)
    at sun.reflect.DelegatingMethodAccessorImpl.invoke (DelegatingMethodAccessorImpl.java:43)
    at java.lang.reflect.Method.invoke (Method.java:498)
    at org.codehaus.plexus.classworlds.launcher.Launcher.launchEnhanced (Launcher.java:289)
    at org.codehaus.plexus.classworlds.launcher.Launcher.launch (Launcher.java:229)
    at org.codehaus.plexus.classworlds.launcher.Launcher.mainWithExitCode (Launcher.java:415)
    at org.codehaus.plexus.classworlds.launcher.Launcher.main (Launcher.java:356)
Caused by: com.spotify.docker.client.shaded.javax.ws.rs.ProcessingException: java.io.IOException: No such file or directory
    at com.spotify.docker.client.shaded.org.glassfish.jersey.apache.connector.ApacheConnector.apply (ApacheConnector.java:481)
    at com.spotify.docker.client.shaded.org.glassfish.jersey.apache.connector.ApacheConnector$1.run (ApacheConnector.java:491)
    at java.util.concurrent.Executors$RunnableAdapter.call (Executors.java:511)
    at java.util.concurrent.FutureTask.run (FutureTask.java:266)
    at jersey.repackaged.com.google.common.util.concurrent.MoreExecutors$DirectExecutorService.execute (MoreExecutors.java:299)
    at java.util.concurrent.AbstractExecutorService.submit (AbstractExecutorService.java:112)
    at jersey.repackaged.com.google.common.util.concurrent.AbstractListeningExecutorService.submit (AbstractListeningExecutorService.java:50)
    at jersey.repackaged.com.google.common.util.concurrent.AbstractListeningExecutorService.submit (AbstractListeningExecutorService.java:37)
    at com.spotify.docker.client.shaded.org.glassfish.jersey.apache.connector.ApacheConnector.apply (ApacheConnector.java:487)
    at com.spotify.docker.client.shaded.org.glassfish.jersey.client.ClientRuntime$2.run (ClientRuntime.java:178)
    at com.spotify.docker.client.shaded.org.glassfish.jersey.internal.Errors$1.call (Errors.java:271)
    at com.spotify.docker.client.shaded.org.glassfish.jersey.internal.Errors$1.call (Errors.java:267)
    at com.spotify.docker.client.shaded.org.glassfish.jersey.internal.Errors.process (Errors.java:315)
    at com.spotify.docker.client.shaded.org.glassfish.jersey.internal.Errors.process (Errors.java:297)
    at com.spotify.docker.client.shaded.org.glassfish.jersey.internal.Errors.process (Errors.java:267)
    at com.spotify.docker.client.shaded.org.glassfish.jersey.process.internal.RequestScope.runInScope (RequestScope.java:340)
    at com.spotify.docker.client.shaded.org.glassfish.jersey.client.ClientRuntime$3.run (ClientRuntime.java:210)
    at java.util.concurrent.Executors$RunnableAdapter.call (Executors.java:511)
    at java.util.concurrent.FutureTask.run (FutureTask.java:266)
    at java.util.concurrent.ThreadPoolExecutor.runWorker (ThreadPoolExecutor.java:1142)
    at java.util.concurrent.ThreadPoolExecutor$Worker.run (ThreadPoolExecutor.java:617)
    at java.lang.Thread.run (Thread.java:745)
Caused by: java.io.IOException: No such file or directory
    at jnr.unixsocket.UnixSocketChannel.doConnect (UnixSocketChannel.java:127)
    at jnr.unixsocket.UnixSocketChannel.connect (UnixSocketChannel.java:136)
    at jnr.unixsocket.UnixSocketChannel.connect (UnixSocketChannel.java:223)
    at com.spotify.docker.client.UnixConnectionSocketFactory.connectSocket (UnixConnectionSocketFactory.java:85)
    at com.spotify.docker.client.shaded.org.apache.http.impl.conn.DefaultHttpClientConnectionOperator.connect (DefaultHttpClientConnectionOperator.java:134)
    at com.spotify.docker.client.shaded.org.apache.http.impl.conn.PoolingHttpClientConnectionManager.connect (PoolingHttpClientConnectionManager.java:353)
    at com.spotify.docker.client.shaded.org.apache.http.impl.execchain.MainClientExec.establishRoute (MainClientExec.java:380)
    at com.spotify.docker.client.shaded.org.apache.http.impl.execchain.MainClientExec.execute (MainClientExec.java:236)
    at com.spotify.docker.client.shaded.org.apache.http.impl.execchain.ProtocolExec.execute (ProtocolExec.java:184)
    at com.spotify.docker.client.shaded.org.apache.http.impl.execchain.RetryExec.execute (RetryExec.java:88)
    at com.spotify.docker.client.shaded.org.apache.http.impl.execchain.RedirectExec.execute (RedirectExec.java:110)
    at com.spotify.docker.client.shaded.org.apache.http.impl.client.InternalHttpClient.doExecute (InternalHttpClient.java:184)
    at com.spotify.docker.client.shaded.org.apache.http.impl.client.CloseableHttpClient.execute (CloseableHttpClient.java:71)
    at com.spotify.docker.client.shaded.org.glassfish.jersey.apache.connector.ApacheConnector.apply (ApacheConnector.java:435)
    at com.spotify.docker.client.shaded.org.glassfish.jersey.apache.connector.ApacheConnector$1.run (ApacheConnector.java:491)
    at java.util.concurrent.Executors$RunnableAdapter.call (Executors.java:511)
    at java.util.concurrent.FutureTask.run (FutureTask.java:266)
    at jersey.repackaged.com.google.common.util.concurrent.MoreExecutors$DirectExecutorService.execute (MoreExecutors.java:299)
    at java.util.concurrent.AbstractExecutorService.submit (AbstractExecutorService.java:112)
    at jersey.repackaged.com.google.common.util.concurrent.AbstractListeningExecutorService.submit (AbstractListeningExecutorService.java:50)
    at jersey.repackaged.com.google.common.util.concurrent.AbstractListeningExecutorService.submit (AbstractListeningExecutorService.java:37)
    at com.spotify.docker.client.shaded.org.glassfish.jersey.apache.connector.ApacheConnector.apply (ApacheConnector.java:487)
    at com.spotify.docker.client.shaded.org.glassfish.jersey.client.ClientRuntime$2.run (ClientRuntime.java:178)
    at com.spotify.docker.client.shaded.org.glassfish.jersey.internal.Errors$1.call (Errors.java:271)
    at com.spotify.docker.client.shaded.org.glassfish.jersey.internal.Errors$1.call (Errors.java:267)
    at com.spotify.docker.client.shaded.org.glassfish.jersey.internal.Errors.process (Errors.java:315)
    at com.spotify.docker.client.shaded.org.glassfish.jersey.internal.Errors.process (Errors.java:297)
    at com.spotify.docker.client.shaded.org.glassfish.jersey.internal.Errors.process (Errors.java:267)
    at com.spotify.docker.client.shaded.org.glassfish.jersey.process.internal.RequestScope.runInScope (RequestScope.java:340)
    at com.spotify.docker.client.shaded.org.glassfish.jersey.client.ClientRuntime$3.run (ClientRuntime.java:210)
    at java.util.concurrent.Executors$RunnableAdapter.call (Executors.java:511)
    at java.util.concurrent.FutureTask.run (FutureTask.java:266)
    at java.util.concurrent.ThreadPoolExecutor.runWorker (ThreadPoolExecutor.java:1142)
    at java.util.concurrent.ThreadPoolExecutor$Worker.run (ThreadPoolExecutor.java:617)
    at java.lang.Thread.run (Thread.java:745)
[INFO] Building Docker context /usr/build/dist
[INFO] 
[INFO] Image will be built as apache/brooklyn:1.0.0-SNAPSHOT
[INFO] 
Nov 04, 2018 9:54:01 AM com.spotify.docker.client.shaded.org.apache.http.impl.execchain.RetryExec execute
INFO: I/O exception (java.io.IOException) caught when processing request to {}->unix://localhost:80: No such file or directory
Nov 04, 2018 9:54:01 AM com.spotify.docker.client.shaded.org.apache.http.impl.execchain.RetryExec execute
INFO: Retrying request to {}->unix://localhost:80
Nov 04, 2018 9:54:01 AM com.spotify.docker.client.shaded.org.apache.http.impl.execchain.RetryExec execute
INFO: I/O exception (java.io.IOException) caught when processing request to {}->unix://localhost:80: No such file or directory
Nov 04, 2018 9:54:01 AM com.spotify.docker.client.shaded.org.apache.http.impl.execchain.RetryExec execute
INFO: Retrying request to {}->unix://localhost:80
Nov 04, 2018 9:54:01 AM com.spotify.docker.client.shaded.org.apache.http.impl.execchain.RetryExec execute
INFO: I/O exception (java.io.IOException) caught when processing request to {}->unix://localhost:80: No such file or directory
Nov 04, 2018 9:54:01 AM com.spotify.docker.client.shaded.org.apache.http.impl.execchain.RetryExec execute
INFO: Retrying request to {}->unix://localhost:80
[INFO] ------------------------------------------------------------------------
[INFO] Reactor Summary:
[INFO] 
[INFO] Brooklyn Downstream Project Parent ................. SUCCESS [  6.587 s]
[INFO] Brooklyn Dist Root ................................. SUCCESS [  7.769 s]
[INFO] Brooklyn All Things ................................ SUCCESS [ 17.628 s]
[INFO] Brooklyn Distribution .............................. FAILURE [01:00 min]
[INFO] Brooklyn Karaf Distribution Parent ................. SKIPPED
[INFO] Brooklyn Karaf Server Configuration ................ SKIPPED
[INFO] Brooklyn Dist Karaf Features ....................... SKIPPED
[INFO] Brooklyn Karaf Distribution ........................ SKIPPED
[INFO] Brooklyn Karaf pax-exam itest ...................... SKIPPED
[INFO] Brooklyn Vagrant Getting Started Environment ....... SKIPPED
[INFO] Brooklyn Quick-Start Project Archetype ............. SKIPPED
[INFO] Brooklyn Shared Package Files ...................... SKIPPED
[INFO] Brooklyn RPM Package ............................... SKIPPED
[INFO] Brooklyn DEB Package ............................... SKIPPED
[INFO] ------------------------------------------------------------------------
[INFO] BUILD FAILURE
[INFO] ------------------------------------------------------------------------
[INFO] Total time: 01:35 min
[INFO] Finished at: 2018-11-04T09:54:01Z
[INFO] Final Memory: 79M/713M
[INFO] ------------------------------------------------------------------------
[ERROR] Failed to execute goal com.spotify:dockerfile-maven-plugin:1.4.0:build (default) on project brooklyn-dist: Could not build image: java.util.concurrent.ExecutionException: com.spotify.docker.client.shaded.javax.ws.rs.ProcessingException: java.io.IOException: No such file or directory -> [Help 1]
[ERROR] 
[ERROR] To see the full stack trace of the errors, re-run Maven with the -e switch.
[ERROR] Re-run Maven using the -X switch to enable full debug logging.
[ERROR] 
[ERROR] For more information about the errors and possible solutions, please read the following articles:
[ERROR] [Help 1] http://cwiki.apache.org/confluence/display/MAVEN/MojoExecutionException
[ERROR] 
[ERROR] After correcting the problems, you can resume the build with the command
[ERROR]   mvn <goals> -rf :brooklyn-dist
Build step 'Conditional step (single)' marked build as failure
Recording test results
TestNG Reports Processing: START
Looking for TestNG results report in workspace using pattern: **/testng-results.xml
Saving reports...
Processing '/x1/jenkins/jenkins-home/jobs/brooklyn-dist-master-docker/builds/112/testng/testng-results-1.xml'
Processing '/x1/jenkins/jenkins-home/jobs/brooklyn-dist-master-docker/builds/112/testng/testng-results.xml'
TestNG Reports Processing: FINISH