git.net

[Date Prev][Date Next][Thread Prev][Thread Next][Date Index][Thread Index]

Build failed in Jenkins: brooklyn-master-build-docker #908


See <https://builds.apache.org/job/brooklyn-master-build-docker/908/display/redirect>

------------------------------------------
[...truncated 6.44 MB...]
	Item 'MockItem[item-3]' (44.0)
	Item 'MockItem[item-17]' (45.0)
	Item 'MockItem[item-19]' (46.0)
	Item 'MockItem[item-28]' (47.0)
	Item 'MockItem[item-20]' (49.0)
	Item 'MockItem[item-6]' (48.0)
	Item 'MockItem[item-15]' (47.0)
	Item 'MockItem[item-10]' (48.0)
	Item 'MockItem[item-14]' (47.0)
	Item 'MockItem[item-5]' (45.0)
	Item 'MockItem[item-8]' (47.0)
	Item 'MockItem[item-22]' (46.0)
	Item 'MockItem[item-11.1.1]' (45.0)
	Item 'MockItem[item-23]' (46.0)
	Item 'MockItem[item-4]' (49.0)
	Item 'MockItem[item-18]' (45.0)
	Item 'MockItem[item-21]' (46.0)
	Item 'MockItem[item-29]' (46.0)
	Item 'MockItem[item-13]' (49.0)
	Item 'MockItem[item-9]' (48.0)
Container 'MockContainer[container-3]': 
	Item 'MockItem[item-26]' (52.0)
Container 'MockContainer[container-4]': 
	Item 'MockItem[item-16]' (50.0)
Container 'MockContainer[container-5]': 
	Item 'MockItem[item-2]' (49.0)
Container 'MockContainer[container-2]': 
; totalMoves=50; lastMoveTime=2018-11-02 23:10:16.485; itemRates=[47, 49, 44, 49, 45, 48, 44, 47, 48, 48, 45, 44, 49, 47, 47, 50, 45, 45, 46, 49, 46, 46, 46, 50, 52, 52, 51, 47, 46, 52] expected [true] but found [false]
	at org.apache.brooklyn.policy.loadbalancing.LoadBalancingPolicySoakTest.runLoadBalancingSoakTest(LoadBalancingPolicySoakTest.java:177)
	at org.apache.brooklyn.policy.loadbalancing.LoadBalancingPolicySoakTest.testLoadBalancingManyItemsQuickTest(LoadBalancingPolicySoakTest.java:71)
Caused by: java.lang.AssertionError: 
containers=[MockContainer[container-1], MockContainer[container-2.1.1], MockContainer[container-3], MockContainer[container-4], MockContainer[container-5]]; containerRates=[1068.0, 205.0, 52.0, 50.0, 49.0]; itemDistributionByContainer={MockContainer[container-1]=[MockItem[item-1], MockItem[item-3], MockItem[item-4], MockItem[item-5], MockItem[item-6], MockItem[item-7], MockItem[item-8], MockItem[item-9], MockItem[item-10], MockItem[item-12], MockItem[item-13], MockItem[item-14], MockItem[item-15], MockItem[item-17], MockItem[item-18], MockItem[item-19], MockItem[item-20], MockItem[item-21], MockItem[item-22], MockItem[item-23], MockItem[item-28], MockItem[item-29], MockItem[item-11.1.1]], MockContainer[container-2.1.1]=[MockItem[item-30], MockItem[item-25], MockItem[item-27], MockItem[item-24]], MockContainer[container-3]=[MockItem[item-26]], MockContainer[container-4]=[MockItem[item-16]], MockContainer[container-5]=[MockItem[item-2]]}; itemDistributionByItem={MockItem[item-1]=MockContainer[container-1], MockItem[item-2]=MockContainer[container-5], MockItem[item-3]=MockContainer[container-1], MockItem[item-4]=MockContainer[container-1], MockItem[item-5]=MockContainer[container-1], MockItem[item-6]=MockContainer[container-1], MockItem[item-7]=MockContainer[container-1], MockItem[item-8]=MockContainer[container-1], MockItem[item-9]=MockContainer[container-1], MockItem[item-10]=MockContainer[container-1], MockItem[item-11.1.1]=MockContainer[container-1], MockItem[item-12]=MockContainer[container-1], MockItem[item-13]=MockContainer[container-1], MockItem[item-14]=MockContainer[container-1], MockItem[item-15]=MockContainer[container-1], MockItem[item-16]=MockContainer[container-4], MockItem[item-17]=MockContainer[container-1], MockItem[item-18]=MockContainer[container-1], MockItem[item-19]=MockContainer[container-1], MockItem[item-20]=MockContainer[container-1], MockItem[item-21]=MockContainer[container-1], MockItem[item-22]=MockContainer[container-1], MockItem[item-23]=MockContainer[container-1], MockItem[item-24]=MockContainer[container-2.1.1], MockItem[item-25]=MockContainer[container-2.1.1], MockItem[item-26]=MockContainer[container-3], MockItem[item-27]=MockContainer[container-2.1.1], MockItem[item-28]=MockContainer[container-1], MockItem[item-29]=MockContainer[container-1], MockItem[item-30]=MockContainer[container-2.1.1]}; model=Container 'MockContainer[container-2.1.1]': 
	Item 'MockItem[item-27]' (51.0)
	Item 'MockItem[item-24]' (50.0)
	Item 'MockItem[item-30]' (52.0)
	Item 'MockItem[item-25]' (52.0)
Container 'MockContainer[container-1]': 
	Item 'MockItem[item-1]' (47.0)
	Item 'MockItem[item-7]' (44.0)
	Item 'MockItem[item-12]' (44.0)
	Item 'MockItem[item-3]' (44.0)
	Item 'MockItem[item-17]' (45.0)
	Item 'MockItem[item-19]' (46.0)
	Item 'MockItem[item-28]' (47.0)
	Item 'MockItem[item-20]' (49.0)
	Item 'MockItem[item-6]' (48.0)
	Item 'MockItem[item-15]' (47.0)
	Item 'MockItem[item-10]' (48.0)
	Item 'MockItem[item-14]' (47.0)
	Item 'MockItem[item-5]' (45.0)
	Item 'MockItem[item-8]' (47.0)
	Item 'MockItem[item-22]' (46.0)
	Item 'MockItem[item-11.1.1]' (45.0)
	Item 'MockItem[item-23]' (46.0)
	Item 'MockItem[item-4]' (49.0)
	Item 'MockItem[item-18]' (45.0)
	Item 'MockItem[item-21]' (46.0)
	Item 'MockItem[item-29]' (46.0)
	Item 'MockItem[item-13]' (49.0)
	Item 'MockItem[item-9]' (48.0)
Container 'MockContainer[container-3]': 
	Item 'MockItem[item-26]' (52.0)
Container 'MockContainer[container-4]': 
	Item 'MockItem[item-16]' (50.0)
Container 'MockContainer[container-5]': 
	Item 'MockItem[item-2]' (49.0)
Container 'MockContainer[container-2]': 
; totalMoves=50; lastMoveTime=2018-11-02 23:10:16.485; itemRates=[47, 49, 44, 49, 45, 48, 44, 47, 48, 48, 45, 44, 49, 47, 47, 50, 45, 45, 46, 49, 46, 46, 46, 50, 52, 52, 51, 47, 46, 52] expected [true] but found [false]
	at org.apache.brooklyn.policy.loadbalancing.LoadBalancingPolicySoakTest.runLoadBalancingSoakTest(LoadBalancingPolicySoakTest.java:177)
	at org.apache.brooklyn.policy.loadbalancing.LoadBalancingPolicySoakTest.testLoadBalancingManyItemsQuickTest(LoadBalancingPolicySoakTest.java:71)


Results :

Failed tests: 
  LoadBalancingPolicySoakTest.testLoadBalancingManyItemsQuickTest:71->runLoadBalancingSoakTest:177 failed succeeds-eventually, 94 attempts, 40002ms elapsed: AssertionError: containers=[MockContainer[container-1], MockContainer[container-2.1.1], MockContainer[container-3], MockContainer[container-4], MockContainer[container-5]]; containerRates=[1068.0, 205.0, 52.0, 50.0, 49.0]; itemDistributionByContainer={MockContainer[container-1]=[MockItem[item-1], MockItem[item-3], MockItem[item-4], MockItem[item-5], MockItem[item-6], MockItem[item-7], MockItem[item-8], MockItem[item-9], MockItem[item-10], MockItem[item-12], MockItem[item-13], MockItem[item-14], MockItem[item-15], MockItem[item-17], MockItem[item-18], MockItem[item-19], MockItem[item-20], MockItem[item-21], MockItem[item-22], MockItem[item-23], MockItem[item-28], MockItem[item-29], MockItem[item-11.1.1]], MockContainer[container-2.1.1]=[MockItem[item-30], MockItem[item-25], MockItem[item-27], MockItem[item-24]], MockContainer[container-3]=[MockItem[item-26]], MockContainer[container-4]=[MockItem[item-16]], MockContainer[container-5]=[MockItem[item-2]]}; itemDistributionByItem={MockItem[item-1]=MockContainer[container-1], MockItem[item-2]=MockContainer[container-5], MockItem[item-3]=MockContainer[container-1], MockItem[item-4]=MockContainer[container-1], MockItem[item-5]=MockContainer[container-1], MockItem[item-6]=MockContainer[container-1], MockItem[item-7]=MockContainer[container-1], MockItem[item-8]=MockContainer[container-1], MockItem[item-9]=MockContainer[container-1], MockItem[item-10]=MockContainer[container-1], MockItem[item-11.1.1]=MockContainer[container-1], MockItem[item-12]=MockContainer[container-1], MockItem[item-13]=MockContainer[container-1], MockItem[item-14]=MockContainer[container-1], MockItem[item-15]=MockContainer[container-1], MockItem[item-16]=MockContainer[container-4], MockItem[item-17]=MockContainer[container-1], MockItem[item-18]=MockContainer[container-1], MockItem[item-19]=MockContainer[container-1], MockItem[item-20]=MockContainer[container-1], MockItem[item-21]=MockContainer[container-1], MockItem[item-22]=MockContainer[container-1], MockItem[item-23]=MockContainer[container-1], MockItem[item-24]=MockContainer[container-2.1.1], MockItem[item-25]=MockContainer[container-2.1.1], MockItem[item-26]=MockContainer[container-3], MockItem[item-27]=MockContainer[container-2.1.1], MockItem[item-28]=MockContainer[container-1], MockItem[item-29]=MockContainer[container-1], MockItem[item-30]=MockContainer[container-2.1.1]}; model=Container 'MockContainer[container-2.1.1]': 
	Item 'MockItem[item-27]' (51.0)
	Item 'MockItem[item-24]' (50.0)
	Item 'MockItem[item-30]' (52.0)
	Item 'MockItem[item-25]' (52.0)
Container 'MockContainer[container-1]': 
	Item 'MockItem[item-1]' (47.0)
	Item 'MockItem[item-7]' (44.0)
	Item 'MockItem[item-12]' (44.0)
	Item 'MockItem[item-3]' (44.0)
	Item 'MockItem[item-17]' (45.0)
	Item 'MockItem[item-19]' (46.0)
	Item 'MockItem[item-28]' (47.0)
	Item 'MockItem[item-20]' (49.0)
	Item 'MockItem[item-6]' (48.0)
	Item 'MockItem[item-15]' (47.0)
	Item 'MockItem[item-10]' (48.0)
	Item 'MockItem[item-14]' (47.0)
	Item 'MockItem[item-5]' (45.0)
	Item 'MockItem[item-8]' (47.0)
	Item 'MockItem[item-22]' (46.0)
	Item 'MockItem[item-11.1.1]' (45.0)
	Item 'MockItem[item-23]' (46.0)
	Item 'MockItem[item-4]' (49.0)
	Item 'MockItem[item-18]' (45.0)
	Item 'MockItem[item-21]' (46.0)
	Item 'MockItem[item-29]' (46.0)
	Item 'MockItem[item-13]' (49.0)
	Item 'MockItem[item-9]' (48.0)
Container 'MockContainer[container-3]': 
	Item 'MockItem[item-26]' (52.0)
Container 'MockContainer[container-4]': 
	Item 'MockItem[item-16]' (50.0)
Container 'MockContainer[container-5]': 
	Item 'MockItem[item-2]' (49.0)
Container 'MockContainer[container-2]': 
; totalMoves=50; lastMoveTime=2018-11-02 23:10:16.485; itemRates=[47, 49, 44, 49, 45, 48, 44, 47, 48, 48, 45, 44, 49, 47, 47, 50, 45, 45, 46, 49, 46, 46, 46, 50, 52, 52, 51, 47, 46, 52] expected [true] but found [false]

Tests run: 137, Failures: 1, Errors: 0, Skipped: 0

[INFO] ------------------------------------------------------------------------
[INFO] Reactor Summary:
[INFO] 
[INFO] Brooklyn Server Root ............................... SUCCESS [  4.275 s]
[INFO] Brooklyn Parent Project ............................ SUCCESS [  5.051 s]
[INFO] Brooklyn Test Support Utilities .................... SUCCESS [  8.052 s]
[INFO] Brooklyn Logback Includable Configuration .......... SUCCESS [  0.376 s]
[INFO] Brooklyn Common Utilities .......................... SUCCESS [ 28.486 s]
[INFO] Brooklyn API ....................................... SUCCESS [  3.592 s]
[INFO] CAMP Server Parent Project ......................... SUCCESS [  0.134 s]
[INFO] CAMP Base .......................................... SUCCESS [  3.766 s]
[INFO] Brooklyn Test Support .............................. SUCCESS [  1.028 s]
[INFO] Brooklyn REST Swagger Apidoc Utilities ............. SUCCESS [ 13.796 s]
[INFO] Brooklyn Logback Configuration ..................... SUCCESS [  0.228 s]
[INFO] CAMP Server ........................................ SUCCESS [ 13.590 s]
[INFO] Brooklyn Felix Runtime ............................. SUCCESS [  3.517 s]
[INFO] Brooklyn Groovy Utilities .......................... SUCCESS [  2.279 s]
[INFO] Brooklyn Core ...................................... SUCCESS [04:19 min]
[INFO] Brooklyn Policies .................................. FAILURE [01:13 min]
[INFO] Brooklyn WinRM Software Entities ................... SKIPPED
[INFO] Brooklyn Secure JMXMP Agent ........................ SKIPPED
[INFO] Brooklyn JMX RMI Agent ............................. SKIPPED
[INFO] Brooklyn Jclouds Location Targets .................. SKIPPED
[INFO] Brooklyn Software Base ............................. SKIPPED
[INFO] Brooklyn CAMP ...................................... SKIPPED
[INFO] Brooklyn Launcher Common ........................... SKIPPED
[INFO] Brooklyn REST API .................................. SKIPPED
[INFO] Brooklyn REST Resources ............................ SKIPPED
[INFO] Brooklyn REST Server ............................... SKIPPED
[INFO] Brooklyn Launcher .................................. SKIPPED
[INFO] Brooklyn Container Location Targets ................ SKIPPED
[INFO] Brooklyn Command Line Interface .................... SKIPPED
[INFO] Brooklyn Test Framework ............................ SKIPPED
[INFO] Brooklyn OSGi init ................................. SKIPPED
[INFO] Brooklyn OSGi start ................................ SKIPPED
[INFO] Brooklyn Karaf ..................................... SKIPPED
[INFO] Jetty config fragment .............................. SKIPPED
[INFO] Apache Http Component extension .................... SKIPPED
[INFO] Brooklyn Karaf Features ............................ SKIPPED
[INFO] Brooklyn Karaf Shell Commands ...................... SKIPPED
[INFO] Brooklyn UI :: Parent .............................. SKIPPED
[INFO] Brooklyn UI :: Modularity Server (parent) .......... SKIPPED
[INFO] Brooklyn UI :: Modularity Server :: UI Module API .. SKIPPED
[INFO] Brooklyn UI :: Modularity Server :: UI Module Registry SKIPPED
[INFO] Brooklyn UI :: Modularity Server :: UI Proxy ....... SKIPPED
[INFO] Brooklyn UI :: Modularity Server :: UI Metadata Registry SKIPPED
[INFO] Brooklyn UI :: Modularity Server :: External UI Modules Registration Hooks SKIPPED
[INFO] Brooklyn UI :: Modularity Server :: Features ....... SKIPPED
[INFO] Brooklyn UI :: Modules (parent) .................... SKIPPED
[INFO] Brooklyn UI :: Modules - UI Utils .................. SKIPPED
[INFO] Brooklyn UI :: Modules - Home ...................... SKIPPED
[INFO] Brooklyn UI :: Modules - App inspector ............. SKIPPED
[INFO] Brooklyn UI :: Modules - Blueprint composer ........ SKIPPED
[INFO] Brooklyn UI :: Modules - Blueprint importer ........ SKIPPED
[INFO] Brooklyn UI :: Modules - Catalog ................... SKIPPED
[INFO] Brooklyn UI :: Modules - Location manager .......... SKIPPED
[INFO] Brooklyn UI :: Modules - REST API Docs ............. SKIPPED
[INFO] Brooklyn UI :: Modules - Groovy console ............ SKIPPED
[INFO] Brooklyn UI :: Modules - Logout .................... SKIPPED
[INFO] Brooklyn UI :: Modules - Features .................. SKIPPED
[INFO] Brooklyn UI :: Features ............................ SKIPPED
[INFO] Brooklyn Library Root .............................. SKIPPED
[INFO] Brooklyn CM Chef ................................... SKIPPED
[INFO] Brooklyn CM SaltStack .............................. SKIPPED
[INFO] Brooklyn CM Ansible ................................ SKIPPED
[INFO] Brooklyn CM Integration Root ....................... SKIPPED
[INFO] Brooklyn Network Software Entities ................. SKIPPED
[INFO] Brooklyn OSGi Software Entities .................... SKIPPED
[INFO] Brooklyn Database Software Entities ................ SKIPPED
[INFO] Brooklyn Web App Software Entities ................. SKIPPED
[INFO] Brooklyn Messaging Software Entities ............... SKIPPED
[INFO] Brooklyn NoSQL Data Store Software Entities ........ SKIPPED
[INFO] Brooklyn Monitoring Software Entities .............. SKIPPED
[INFO] Brooklyn Web App Software Entities ................. SKIPPED
[INFO] Brooklyn QA ........................................ SKIPPED
[INFO] Brooklyn Examples Aggregator Project ............... SKIPPED
[INFO] Brooklyn Examples Aggregator Project - Webapps ..... SKIPPED
[INFO] hello-world-webapp Maven Webapp .................... SKIPPED
[INFO] hello-world-sql-webapp Maven Webapp ................ SKIPPED
[INFO] Brooklyn Simple Web Cluster Example ................ SKIPPED
[INFO] Brooklyn Library Karaf integration ................. SKIPPED
[INFO] Brooklyn Library Catalog ........................... SKIPPED
[INFO] Brooklyn Library Karaf Features .................... SKIPPED
[INFO] Brooklyn Client .................................... SKIPPED
[INFO] Brooklyn Client Command Line Interface ............. SKIPPED
[INFO] Brooklyn REST java Client .......................... SKIPPED
[INFO] Brooklyn Downstream Project Parent ................. SKIPPED
[INFO] Brooklyn Dist Root ................................. SKIPPED
[INFO] Brooklyn All Things ................................ SKIPPED
[INFO] Brooklyn Distribution .............................. SKIPPED
[INFO] Brooklyn Karaf Distribution Parent ................. SKIPPED
[INFO] Brooklyn Karaf Server Configuration ................ SKIPPED
[INFO] Brooklyn Dist Karaf Features ....................... SKIPPED
[INFO] Brooklyn Karaf Distribution ........................ SKIPPED
[INFO] Brooklyn Karaf pax-exam itest ...................... SKIPPED
[INFO] Brooklyn Vagrant Getting Started Environment ....... SKIPPED
[INFO] Brooklyn Quick-Start Project Archetype ............. SKIPPED
[INFO] Brooklyn Shared Package Files ...................... SKIPPED
[INFO] Brooklyn RPM Package ............................... SKIPPED
[INFO] Brooklyn DEB Package ............................... SKIPPED
[INFO] Brooklyn Root 1.0.0-SNAPSHOT ....................... SKIPPED
[INFO] ------------------------------------------------------------------------
[INFO] BUILD FAILURE
[INFO] ------------------------------------------------------------------------
[INFO] Total time: 07:24 min
[INFO] Finished at: 2018-11-02T23:11:05Z
[INFO] ------------------------------------------------------------------------
[ERROR] Failed to execute goal org.apache.maven.plugins:maven-surefire-plugin:2.19.1:test (default-test) on project brooklyn-policy: There are test failures.
[ERROR] 
[ERROR] Please refer to /usr/build/brooklyn-server/policy/target/surefire-reports for the individual test results.
[ERROR] -> [Help 1]
[ERROR] 
[ERROR] To see the full stack trace of the errors, re-run Maven with the -e switch.
[ERROR] Re-run Maven using the -X switch to enable full debug logging.
[ERROR] 
[ERROR] For more information about the errors and possible solutions, please read the following articles:
[ERROR] [Help 1] http://cwiki.apache.org/confluence/display/MAVEN/MojoFailureException
[ERROR] 
[ERROR] After correcting the problems, you can resume the build with the command
[ERROR]   mvn <goals> -rf :brooklyn-policy
Build step 'Execute shell' marked build as failure
Recording test results
TestNG Reports Processing: START
Looking for TestNG results report in workspace using pattern: **/testng-results.xml
Saving reports...
Processing '/x1/jenkins/jenkins-home/jobs/brooklyn-master-build-docker/builds/908/testng/testng-results-1.xml'
Processing '/x1/jenkins/jenkins-home/jobs/brooklyn-master-build-docker/builds/908/testng/testng-results-2.xml'
Processing '/x1/jenkins/jenkins-home/jobs/brooklyn-master-build-docker/builds/908/testng/testng-results-3.xml'
Processing '/x1/jenkins/jenkins-home/jobs/brooklyn-master-build-docker/builds/908/testng/testng-results-4.xml'
Processing '/x1/jenkins/jenkins-home/jobs/brooklyn-master-build-docker/builds/908/testng/testng-results-5.xml'
Processing '/x1/jenkins/jenkins-home/jobs/brooklyn-master-build-docker/builds/908/testng/testng-results-6.xml'
Processing '/x1/jenkins/jenkins-home/jobs/brooklyn-master-build-docker/builds/908/testng/testng-results.xml'
0.032331% of tests failed, which exceeded threshold of 0%. Marking build as UNSTABLE
TestNG Reports Processing: FINISH