git.net

[Date Prev][Date Next][Thread Prev][Thread Next][Date Index][Thread Index]

Build failed in Jenkins: brooklyn-master-build-docker #907


See <https://builds.apache.org/job/brooklyn-master-build-docker/907/display/redirect>

------------------------------------------
[...truncated 50.48 MB...]
[INFO] [INFO] ------------------------------------------------------------------------
[INFO] [ERROR] Failed to execute goal org.apache.maven.plugins:maven-surefire-plugin:2.18.1:test (default-test) on project brooklyn-sample: Execution default-test of goal org.apache.maven.plugins:maven-surefire-plugin:2.18.1:test failed: The forked VM terminated without properly saying goodbye. VM crash or System.exit called?
[INFO] [ERROR] Command was /bin/sh -c cd /usr/build/brooklyn-dist/archetypes/quickstart/target/test-classes/projects/integration-test-1/project/brooklyn-sample && /usr/lib/jvm/java-8-openjdk-amd64/jre/bin/java -Xms256m -Xmx512m -jar /usr/build/brooklyn-dist/archetypes/quickstart/target/test-classes/projects/integration-test-1/project/brooklyn-sample/target/surefire/surefirebooter3270909950153470885.jar /usr/build/brooklyn-dist/archetypes/quickstart/target/test-classes/projects/integration-test-1/project/brooklyn-sample/target/surefire/surefire1181598742034801147tmp /usr/build/brooklyn-dist/archetypes/quickstart/target/test-classes/projects/integration-test-1/project/brooklyn-sample/target/surefire/surefire_03936463161299703485tmp
[INFO] [ERROR] -> [Help 1]
[INFO] org.apache.maven.lifecycle.LifecycleExecutionException: Failed to execute goal org.apache.maven.plugins:maven-surefire-plugin:2.18.1:test (default-test) on project brooklyn-sample: Execution default-test of goal org.apache.maven.plugins:maven-surefire-plugin:2.18.1:test failed: The forked VM terminated without properly saying goodbye. VM crash or System.exit called?
[INFO] Command was /bin/sh -c cd /usr/build/brooklyn-dist/archetypes/quickstart/target/test-classes/projects/integration-test-1/project/brooklyn-sample && /usr/lib/jvm/java-8-openjdk-amd64/jre/bin/java -Xms256m -Xmx512m -jar /usr/build/brooklyn-dist/archetypes/quickstart/target/test-classes/projects/integration-test-1/project/brooklyn-sample/target/surefire/surefirebooter3270909950153470885.jar /usr/build/brooklyn-dist/archetypes/quickstart/target/test-classes/projects/integration-test-1/project/brooklyn-sample/target/surefire/surefire1181598742034801147tmp /usr/build/brooklyn-dist/archetypes/quickstart/target/test-classes/projects/integration-test-1/project/brooklyn-sample/target/surefire/surefire_03936463161299703485tmp
[INFO]     at org.apache.maven.lifecycle.internal.MojoExecutor.execute (MojoExecutor.java:213)
[INFO]     at org.apache.maven.lifecycle.internal.MojoExecutor.execute (MojoExecutor.java:154)
[INFO]     at org.apache.maven.lifecycle.internal.MojoExecutor.execute (MojoExecutor.java:146)
[INFO]     at org.apache.maven.lifecycle.internal.LifecycleModuleBuilder.buildProject (LifecycleModuleBuilder.java:117)
[INFO]     at org.apache.maven.lifecycle.internal.LifecycleModuleBuilder.buildProject (LifecycleModuleBuilder.java:81)
[INFO]     at org.apache.maven.lifecycle.internal.builder.singlethreaded.SingleThreadedBuilder.build (SingleThreadedBuilder.java:56)
[INFO]     at org.apache.maven.lifecycle.internal.LifecycleStarter.execute (LifecycleStarter.java:128)
[INFO]     at org.apache.maven.DefaultMaven.doExecute (DefaultMaven.java:305)
[INFO]     at org.apache.maven.DefaultMaven.doExecute (DefaultMaven.java:192)
[INFO]     at org.apache.maven.DefaultMaven.execute (DefaultMaven.java:105)
[INFO]     at org.apache.maven.cli.MavenCli.execute (MavenCli.java:954)
[INFO]     at org.apache.maven.cli.MavenCli.doMain (MavenCli.java:288)
[INFO]     at org.apache.maven.cli.MavenCli.main (MavenCli.java:192)
[INFO]     at sun.reflect.NativeMethodAccessorImpl.invoke0 (Native Method)
[INFO]     at sun.reflect.NativeMethodAccessorImpl.invoke (NativeMethodAccessorImpl.java:62)
[INFO]     at sun.reflect.DelegatingMethodAccessorImpl.invoke (DelegatingMethodAccessorImpl.java:43)
[INFO]     at java.lang.reflect.Method.invoke (Method.java:498)
[INFO]     at org.codehaus.plexus.classworlds.launcher.Launcher.launchEnhanced (Launcher.java:289)
[INFO]     at org.codehaus.plexus.classworlds.launcher.Launcher.launch (Launcher.java:229)
[INFO]     at org.codehaus.plexus.classworlds.launcher.Launcher.mainWithExitCode (Launcher.java:415)
[INFO]     at org.codehaus.plexus.classworlds.launcher.Launcher.main (Launcher.java:356)
[INFO] Caused by: org.apache.maven.plugin.PluginExecutionException: Execution default-test of goal org.apache.maven.plugins:maven-surefire-plugin:2.18.1:test failed: The forked VM terminated without properly saying goodbye. VM crash or System.exit called?
[INFO] Command was /bin/sh -c cd /usr/build/brooklyn-dist/archetypes/quickstart/target/test-classes/projects/integration-test-1/project/brooklyn-sample && /usr/lib/jvm/java-8-openjdk-amd64/jre/bin/java -Xms256m -Xmx512m -jar /usr/build/brooklyn-dist/archetypes/quickstart/target/test-classes/projects/integration-test-1/project/brooklyn-sample/target/surefire/surefirebooter3270909950153470885.jar /usr/build/brooklyn-dist/archetypes/quickstart/target/test-classes/projects/integration-test-1/project/brooklyn-sample/target/surefire/surefire1181598742034801147tmp /usr/build/brooklyn-dist/archetypes/quickstart/target/test-classes/projects/integration-test-1/project/brooklyn-sample/target/surefire/surefire_03936463161299703485tmp
[INFO]     at org.apache.maven.plugin.DefaultBuildPluginManager.executeMojo (DefaultBuildPluginManager.java:148)
[INFO]     at org.apache.maven.lifecycle.internal.MojoExecutor.execute (MojoExecutor.java:208)
[INFO]     at org.apache.maven.lifecycle.internal.MojoExecutor.execute (MojoExecutor.java:154)
[INFO]     at org.apache.maven.lifecycle.internal.MojoExecutor.execute (MojoExecutor.java:146)
[INFO]     at org.apache.maven.lifecycle.internal.LifecycleModuleBuilder.buildProject (LifecycleModuleBuilder.java:117)
[INFO]     at org.apache.maven.lifecycle.internal.LifecycleModuleBuilder.buildProject (LifecycleModuleBuilder.java:81)
[INFO]     at org.apache.maven.lifecycle.internal.builder.singlethreaded.SingleThreadedBuilder.build (SingleThreadedBuilder.java:56)
[INFO]     at org.apache.maven.lifecycle.internal.LifecycleStarter.execute (LifecycleStarter.java:128)
[INFO]     at org.apache.maven.DefaultMaven.doExecute (DefaultMaven.java:305)
[INFO]     at org.apache.maven.DefaultMaven.doExecute (DefaultMaven.java:192)
[INFO]     at org.apache.maven.DefaultMaven.execute (DefaultMaven.java:105)
[INFO]     at org.apache.maven.cli.MavenCli.execute (MavenCli.java:954)
[INFO]     at org.apache.maven.cli.MavenCli.doMain (MavenCli.java:288)
[INFO]     at org.apache.maven.cli.MavenCli.main (MavenCli.java:192)
[INFO]     at sun.reflect.NativeMethodAccessorImpl.invoke0 (Native Method)
[INFO]     at sun.reflect.NativeMethodAccessorImpl.invoke (NativeMethodAccessorImpl.java:62)
[INFO]     at sun.reflect.DelegatingMethodAccessorImpl.invoke (DelegatingMethodAccessorImpl.java:43)
[INFO]     at java.lang.reflect.Method.invoke (Method.java:498)
[INFO]     at org.codehaus.plexus.classworlds.launcher.Launcher.launchEnhanced (Launcher.java:289)
[INFO]     at org.codehaus.plexus.classworlds.launcher.Launcher.launch (Launcher.java:229)
[INFO]     at org.codehaus.plexus.classworlds.launcher.Launcher.mainWithExitCode (Launcher.java:415)
[INFO]     at org.codehaus.plexus.classworlds.launcher.Launcher.main (Launcher.java:356)
[INFO] Caused by: java.lang.RuntimeException: The forked VM terminated without properly saying goodbye. VM crash or System.exit called?
[INFO] Command was /bin/sh -c cd /usr/build/brooklyn-dist/archetypes/quickstart/target/test-classes/projects/integration-test-1/project/brooklyn-sample && /usr/lib/jvm/java-8-openjdk-amd64/jre/bin/java -Xms256m -Xmx512m -jar /usr/build/brooklyn-dist/archetypes/quickstart/target/test-classes/projects/integration-test-1/project/brooklyn-sample/target/surefire/surefirebooter3270909950153470885.jar /usr/build/brooklyn-dist/archetypes/quickstart/target/test-classes/projects/integration-test-1/project/brooklyn-sample/target/surefire/surefire1181598742034801147tmp /usr/build/brooklyn-dist/archetypes/quickstart/target/test-classes/projects/integration-test-1/project/brooklyn-sample/target/surefire/surefire_03936463161299703485tmp
[INFO]     at org.apache.maven.plugin.surefire.booterclient.ForkStarter.fork (ForkStarter.java:515)
[INFO]     at org.apache.maven.plugin.surefire.booterclient.ForkStarter.fork (ForkStarter.java:380)
[INFO]     at org.apache.maven.plugin.surefire.booterclient.ForkStarter.run (ForkStarter.java:167)
[INFO]     at org.apache.maven.plugin.surefire.AbstractSurefireMojo.executeProvider (AbstractSurefireMojo.java:990)
[INFO]     at org.apache.maven.plugin.surefire.AbstractSurefireMojo.executeAfterPreconditionsChecked (AbstractSurefireMojo.java:824)
[INFO]     at org.apache.maven.plugin.surefire.AbstractSurefireMojo.execute (AbstractSurefireMojo.java:722)
[INFO]     at org.apache.maven.plugin.DefaultBuildPluginManager.executeMojo (DefaultBuildPluginManager.java:137)
[INFO]     at org.apache.maven.lifecycle.internal.MojoExecutor.execute (MojoExecutor.java:208)
[INFO]     at org.apache.maven.lifecycle.internal.MojoExecutor.execute (MojoExecutor.java:154)
[INFO]     at org.apache.maven.lifecycle.internal.MojoExecutor.execute (MojoExecutor.java:146)
[INFO]     at org.apache.maven.lifecycle.internal.LifecycleModuleBuilder.buildProject (LifecycleModuleBuilder.java:117)
[INFO]     at org.apache.maven.lifecycle.internal.LifecycleModuleBuilder.buildProject (LifecycleModuleBuilder.java:81)
[INFO]     at org.apache.maven.lifecycle.internal.builder.singlethreaded.SingleThreadedBuilder.build (SingleThreadedBuilder.java:56)
[INFO]     at org.apache.maven.lifecycle.internal.LifecycleStarter.execute (LifecycleStarter.java:128)
[INFO]     at org.apache.maven.DefaultMaven.doExecute (DefaultMaven.java:305)
[INFO]     at org.apache.maven.DefaultMaven.doExecute (DefaultMaven.java:192)
[INFO]     at org.apache.maven.DefaultMaven.execute (DefaultMaven.java:105)
[INFO]     at org.apache.maven.cli.MavenCli.execute (MavenCli.java:954)
[INFO]     at org.apache.maven.cli.MavenCli.doMain (MavenCli.java:288)
[INFO]     at org.apache.maven.cli.MavenCli.main (MavenCli.java:192)
[INFO]     at sun.reflect.NativeMethodAccessorImpl.invoke0 (Native Method)
[INFO]     at sun.reflect.NativeMethodAccessorImpl.invoke (NativeMethodAccessorImpl.java:62)
[INFO]     at sun.reflect.DelegatingMethodAccessorImpl.invoke (DelegatingMethodAccessorImpl.java:43)
[INFO]     at java.lang.reflect.Method.invoke (Method.java:498)
[INFO]     at org.codehaus.plexus.classworlds.launcher.Launcher.launchEnhanced (Launcher.java:289)
[INFO]     at org.codehaus.plexus.classworlds.launcher.Launcher.launch (Launcher.java:229)
[INFO]     at org.codehaus.plexus.classworlds.launcher.Launcher.mainWithExitCode (Launcher.java:415)
[INFO]     at org.codehaus.plexus.classworlds.launcher.Launcher.main (Launcher.java:356)
[INFO] [ERROR] 
[INFO] [ERROR] Re-run Maven using the -X switch to enable full debug logging.
[INFO] [ERROR] 
[INFO] [ERROR] For more information about the errors and possible solutions, please read the following articles:
[INFO] [ERROR] [Help 1] http://cwiki.apache.org/confluence/display/MAVEN/PluginExecutionException
[INFO] Post-archetype-generation invoker exit code: 1
[INFO] ------------------------------------------------------------------------
[INFO] Reactor Summary:
[INFO] 
[INFO] Brooklyn Server Root ............................... SUCCESS [  4.159 s]
[INFO] Brooklyn Parent Project ............................ SUCCESS [  5.129 s]
[INFO] Brooklyn Test Support Utilities .................... SUCCESS [  8.312 s]
[INFO] Brooklyn Logback Includable Configuration .......... SUCCESS [  0.400 s]
[INFO] Brooklyn Common Utilities .......................... SUCCESS [ 29.106 s]
[INFO] Brooklyn API ....................................... SUCCESS [  3.827 s]
[INFO] CAMP Server Parent Project ......................... SUCCESS [  0.140 s]
[INFO] CAMP Base .......................................... SUCCESS [  3.760 s]
[INFO] Brooklyn Test Support .............................. SUCCESS [  1.087 s]
[INFO] Brooklyn REST Swagger Apidoc Utilities ............. SUCCESS [ 14.053 s]
[INFO] Brooklyn Logback Configuration ..................... SUCCESS [  0.240 s]
[INFO] CAMP Server ........................................ SUCCESS [ 13.707 s]
[INFO] Brooklyn Felix Runtime ............................. SUCCESS [  3.388 s]
[INFO] Brooklyn Groovy Utilities .......................... SUCCESS [  2.163 s]
[INFO] Brooklyn Core ...................................... SUCCESS [04:20 min]
[INFO] Brooklyn Policies .................................. SUCCESS [ 33.185 s]
[INFO] Brooklyn WinRM Software Entities ................... SUCCESS [ 20.808 s]
[INFO] Brooklyn Secure JMXMP Agent ........................ SUCCESS [  8.217 s]
[INFO] Brooklyn JMX RMI Agent ............................. SUCCESS [  0.476 s]
[INFO] Brooklyn Jclouds Location Targets .................. SUCCESS [01:06 min]
[INFO] Brooklyn Software Base ............................. SUCCESS [01:32 min]
[INFO] Brooklyn CAMP ...................................... SUCCESS [02:49 min]
[INFO] Brooklyn Launcher Common ........................... SUCCESS [  4.617 s]
[INFO] Brooklyn REST API .................................. SUCCESS [  8.768 s]
[INFO] Brooklyn REST Resources ............................ SUCCESS [ 53.214 s]
[INFO] Brooklyn REST Server ............................... SUCCESS [ 26.177 s]
[INFO] Brooklyn Launcher .................................. SUCCESS [03:20 min]
[INFO] Brooklyn Container Location Targets ................ SUCCESS [ 12.713 s]
[INFO] Brooklyn Command Line Interface .................... SUCCESS [ 11.812 s]
[INFO] Brooklyn Test Framework ............................ SUCCESS [ 21.971 s]
[INFO] Brooklyn OSGi init ................................. SUCCESS [  5.921 s]
[INFO] Brooklyn OSGi start ................................ SUCCESS [  2.973 s]
[INFO] Brooklyn Karaf ..................................... SUCCESS [  0.022 s]
[INFO] Jetty config fragment .............................. SUCCESS [  1.267 s]
[INFO] Apache Http Component extension .................... SUCCESS [  0.198 s]
[INFO] Brooklyn Karaf Features ............................ SUCCESS [  0.764 s]
[INFO] Brooklyn Karaf Shell Commands ...................... SUCCESS [  9.126 s]
[INFO] Brooklyn UI :: Parent .............................. SUCCESS [  2.200 s]
[INFO] Brooklyn UI :: Modularity Server (parent) .......... SUCCESS [  0.090 s]
[INFO] Brooklyn UI :: Modularity Server :: UI Module API .. SUCCESS [  4.088 s]
[INFO] Brooklyn UI :: Modularity Server :: UI Module Registry SUCCESS [  2.448 s]
[INFO] Brooklyn UI :: Modularity Server :: UI Proxy ....... SUCCESS [  4.391 s]
[INFO] Brooklyn UI :: Modularity Server :: UI Metadata Registry SUCCESS [  0.583 s]
[INFO] Brooklyn UI :: Modularity Server :: External UI Modules Registration Hooks SUCCESS [  5.572 s]
[INFO] Brooklyn UI :: Modularity Server :: Features ....... SUCCESS [ 49.424 s]
[INFO] Brooklyn UI :: Modules (parent) .................... SUCCESS [  0.134 s]
[INFO] Brooklyn UI :: Modules - UI Utils .................. SUCCESS [ 51.675 s]
[INFO] Brooklyn UI :: Modules - Home ...................... SUCCESS [02:37 min]
[INFO] Brooklyn UI :: Modules - App inspector ............. SUCCESS [02:37 min]
[INFO] Brooklyn UI :: Modules - Blueprint composer ........ SUCCESS [02:51 min]
[INFO] Brooklyn UI :: Modules - Blueprint importer ........ SUCCESS [02:24 min]
[INFO] Brooklyn UI :: Modules - Catalog ................... SUCCESS [02:31 min]
[INFO] Brooklyn UI :: Modules - Location manager .......... SUCCESS [02:14 min]
[INFO] Brooklyn UI :: Modules - REST API Docs ............. SUCCESS [02:27 min]
[INFO] Brooklyn UI :: Modules - Groovy console ............ SUCCESS [02:18 min]
[INFO] Brooklyn UI :: Modules - Logout .................... SUCCESS [02:18 min]
[INFO] Brooklyn UI :: Modules - Features .................. SUCCESS [  7.253 s]
[INFO] Brooklyn UI :: Features ............................ SUCCESS [  0.179 s]
[INFO] Brooklyn Library Root .............................. SUCCESS [  0.135 s]
[INFO] Brooklyn CM Chef ................................... SUCCESS [  7.601 s]
[INFO] Brooklyn CM SaltStack .............................. SUCCESS [  5.970 s]
[INFO] Brooklyn CM Ansible ................................ SUCCESS [  4.787 s]
[INFO] Brooklyn CM Integration Root ....................... SUCCESS [  0.142 s]
[INFO] Brooklyn Network Software Entities ................. SUCCESS [  5.092 s]
[INFO] Brooklyn OSGi Software Entities .................... SUCCESS [  3.822 s]
[INFO] Brooklyn Database Software Entities ................ SUCCESS [  8.542 s]
[INFO] Brooklyn Web App Software Entities ................. SUCCESS [ 24.329 s]
[INFO] Brooklyn Messaging Software Entities ............... SUCCESS [ 30.549 s]
[INFO] Brooklyn NoSQL Data Store Software Entities ........ SUCCESS [ 38.832 s]
[INFO] Brooklyn Monitoring Software Entities .............. SUCCESS [  3.679 s]
[INFO] Brooklyn Web App Software Entities ................. SUCCESS [  0.166 s]
[INFO] Brooklyn QA ........................................ SUCCESS [ 10.795 s]
[INFO] Brooklyn Examples Aggregator Project ............... SUCCESS [  0.094 s]
[INFO] Brooklyn Examples Aggregator Project - Webapps ..... SUCCESS [  0.084 s]
[INFO] hello-world-webapp Maven Webapp .................... SUCCESS [  0.637 s]
[INFO] hello-world-sql-webapp Maven Webapp ................ SUCCESS [  2.617 s]
[INFO] Brooklyn Simple Web Cluster Example ................ SUCCESS [  5.642 s]
[INFO] Brooklyn Library Karaf integration ................. SUCCESS [  0.086 s]
[INFO] Brooklyn Library Catalog ........................... SUCCESS [  0.175 s]
[INFO] Brooklyn Library Karaf Features .................... SUCCESS [  1.606 s]
[INFO] Brooklyn Client .................................... SUCCESS [  0.099 s]
[INFO] Brooklyn Client Command Line Interface ............. SUCCESS [ 39.438 s]
[INFO] Brooklyn REST java Client .......................... SUCCESS [ 16.523 s]
[INFO] Brooklyn Downstream Project Parent ................. SUCCESS [  0.447 s]
[INFO] Brooklyn Dist Root ................................. SUCCESS [  0.140 s]
[INFO] Brooklyn All Things ................................ SUCCESS [  3.511 s]
[INFO] Brooklyn Distribution .............................. SUCCESS [ 18.636 s]
[INFO] Brooklyn Karaf Distribution Parent ................. SUCCESS [  0.033 s]
[INFO] Brooklyn Karaf Server Configuration ................ SUCCESS [  0.487 s]
[INFO] Brooklyn Dist Karaf Features ....................... SUCCESS [  0.040 s]
[INFO] Brooklyn Karaf Distribution ........................ SUCCESS [ 29.238 s]
[INFO] Brooklyn Karaf pax-exam itest ...................... SUCCESS [02:03 min]
[INFO] Brooklyn Vagrant Getting Started Environment ....... SUCCESS [  0.149 s]
[INFO] Brooklyn Quick-Start Project Archetype ............. FAILURE [ 23.435 s]
[INFO] Brooklyn Shared Package Files ...................... SKIPPED
[INFO] Brooklyn RPM Package ............................... SKIPPED
[INFO] Brooklyn DEB Package ............................... SKIPPED
[INFO] Brooklyn Root 1.0.0-SNAPSHOT ....................... SKIPPED
[INFO] ------------------------------------------------------------------------
[INFO] BUILD FAILURE
[INFO] ------------------------------------------------------------------------
[INFO] Total time: 50:04 min
[INFO] Finished at: 2018-11-02T19:44:26Z
[INFO] ------------------------------------------------------------------------
[ERROR] Failed to execute goal org.apache.maven.plugins:maven-archetype-plugin:2.3:integration-test (default-integration-test) on project brooklyn-archetype-quickstart: 
[ERROR] Archetype IT 'integration-test-1' failed: Execution failure: exit code = 1
[ERROR] -> [Help 1]
[ERROR] 
[ERROR] To see the full stack trace of the errors, re-run Maven with the -e switch.
[ERROR] Re-run Maven using the -X switch to enable full debug logging.
[ERROR] 
[ERROR] For more information about the errors and possible solutions, please read the following articles:
[ERROR] [Help 1] http://cwiki.apache.org/confluence/display/MAVEN/MojoExecutionException
[ERROR] 
[ERROR] After correcting the problems, you can resume the build with the command
[ERROR]   mvn <goals> -rf :brooklyn-archetype-quickstart
Build step 'Execute shell' marked build as failure
Recording test results
TestNG Reports Processing: START
Looking for TestNG results report in workspace using pattern: **/testng-results.xml
Saving reports...
Processing '/x1/jenkins/jenkins-home/jobs/brooklyn-master-build-docker/builds/907/testng/testng-results-1.xml'
Processing '/x1/jenkins/jenkins-home/jobs/brooklyn-master-build-docker/builds/907/testng/testng-results-10.xml'
Processing '/x1/jenkins/jenkins-home/jobs/brooklyn-master-build-docker/builds/907/testng/testng-results-11.xml'
Processing '/x1/jenkins/jenkins-home/jobs/brooklyn-master-build-docker/builds/907/testng/testng-results-12.xml'
Processing '/x1/jenkins/jenkins-home/jobs/brooklyn-master-build-docker/builds/907/testng/testng-results-13.xml'
Processing '/x1/jenkins/jenkins-home/jobs/brooklyn-master-build-docker/builds/907/testng/testng-results-14.xml'
Processing '/x1/jenkins/jenkins-home/jobs/brooklyn-master-build-docker/builds/907/testng/testng-results-15.xml'
Processing '/x1/jenkins/jenkins-home/jobs/brooklyn-master-build-docker/builds/907/testng/testng-results-16.xml'
Processing '/x1/jenkins/jenkins-home/jobs/brooklyn-master-build-docker/builds/907/testng/testng-results-17.xml'
Processing '/x1/jenkins/jenkins-home/jobs/brooklyn-master-build-docker/builds/907/testng/testng-results-18.xml'
Processing '/x1/jenkins/jenkins-home/jobs/brooklyn-master-build-docker/builds/907/testng/testng-results-19.xml'
Processing '/x1/jenkins/jenkins-home/jobs/brooklyn-master-build-docker/builds/907/testng/testng-results-2.xml'
Processing '/x1/jenkins/jenkins-home/jobs/brooklyn-master-build-docker/builds/907/testng/testng-results-20.xml'
Processing '/x1/jenkins/jenkins-home/jobs/brooklyn-master-build-docker/builds/907/testng/testng-results-21.xml'
Processing '/x1/jenkins/jenkins-home/jobs/brooklyn-master-build-docker/builds/907/testng/testng-results-22.xml'
Processing '/x1/jenkins/jenkins-home/jobs/brooklyn-master-build-docker/builds/907/testng/testng-results-23.xml'
Processing '/x1/jenkins/jenkins-home/jobs/brooklyn-master-build-docker/builds/907/testng/testng-results-24.xml'
Processing '/x1/jenkins/jenkins-home/jobs/brooklyn-master-build-docker/builds/907/testng/testng-results-25.xml'
Processing '/x1/jenkins/jenkins-home/jobs/brooklyn-master-build-docker/builds/907/testng/testng-results-26.xml'
Processing '/x1/jenkins/jenkins-home/jobs/brooklyn-master-build-docker/builds/907/testng/testng-results-27.xml'
Processing '/x1/jenkins/jenkins-home/jobs/brooklyn-master-build-docker/builds/907/testng/testng-results-28.xml'
Processing '/x1/jenkins/jenkins-home/jobs/brooklyn-master-build-docker/builds/907/testng/testng-results-29.xml'
Processing '/x1/jenkins/jenkins-home/jobs/brooklyn-master-build-docker/builds/907/testng/testng-results-3.xml'
Processing '/x1/jenkins/jenkins-home/jobs/brooklyn-master-build-docker/builds/907/testng/testng-results-30.xml'
Processing '/x1/jenkins/jenkins-home/jobs/brooklyn-master-build-docker/builds/907/testng/testng-results-31.xml'
Processing '/x1/jenkins/jenkins-home/jobs/brooklyn-master-build-docker/builds/907/testng/testng-results-32.xml'
Processing '/x1/jenkins/jenkins-home/jobs/brooklyn-master-build-docker/builds/907/testng/testng-results-33.xml'
Processing '/x1/jenkins/jenkins-home/jobs/brooklyn-master-build-docker/builds/907/testng/testng-results-34.xml'
Processing '/x1/jenkins/jenkins-home/jobs/brooklyn-master-build-docker/builds/907/testng/testng-results-35.xml'
Processing '/x1/jenkins/jenkins-home/jobs/brooklyn-master-build-docker/builds/907/testng/testng-results-36.xml'
Processing '/x1/jenkins/jenkins-home/jobs/brooklyn-master-build-docker/builds/907/testng/testng-results-4.xml'
Processing '/x1/jenkins/jenkins-home/jobs/brooklyn-master-build-docker/builds/907/testng/testng-results-5.xml'
Processing '/x1/jenkins/jenkins-home/jobs/brooklyn-master-build-docker/builds/907/testng/testng-results-6.xml'
Processing '/x1/jenkins/jenkins-home/jobs/brooklyn-master-build-docker/builds/907/testng/testng-results-7.xml'
Processing '/x1/jenkins/jenkins-home/jobs/brooklyn-master-build-docker/builds/907/testng/testng-results-8.xml'
Processing '/x1/jenkins/jenkins-home/jobs/brooklyn-master-build-docker/builds/907/testng/testng-results-9.xml'
Processing '/x1/jenkins/jenkins-home/jobs/brooklyn-master-build-docker/builds/907/testng/testng-results.xml'
TestNG Reports Processing: FINISH