git.net

[Date Prev][Date Next][Thread Prev][Thread Next][Date Index][Thread Index]

Build failed in Jenkins: Atlas-master-IntegrationTests #1241


See <https://builds.apache.org/job/Atlas-master-IntegrationTests/1241/display/redirect>

------------------------------------------
[...truncated 530.45 KB...]
127.0.0.1 - - [04/May/2018:12:43:26 +0000] "POST //localhost:31000/api/atlas/entities HTTP/1.1" 400 94 "-" "Java/1.8.0_172"
127.0.0.1 - - [04/May/2018:12:43:26 +0000] "POST //localhost:31000/api/atlas/entities HTTP/1.1" 201 874 "-" "Java/1.8.0_172"
127.0.0.1 - - [04/May/2018:12:43:26 +0000] "GET //localhost:31000/api/atlas/v2/types/typedef/name/rStPqb2UMs HTTP/1.1" 404 87 "-" "Java/1.8.0_172"
127.0.0.1 - - [04/May/2018:12:43:26 +0000] "POST //localhost:31000/api/atlas/types HTTP/1.1" 201 103 "-" "Java/1.8.0_172"
127.0.0.1 - - [04/May/2018:12:43:26 +0000] "POST //localhost:31000/api/atlas/entities HTTP/1.1" 201 780 "-" "Java/1.8.0_172"
127.0.0.1 - - [04/May/2018:12:43:26 +0000] "GET //localhost:31000/api/atlas/entities/6508c642-71d8-4b3c-9d46-42a5d52892cf HTTP/1.1" 200 616 "-" "Java/1.8.0_172"
127.0.0.1 - - [04/May/2018:12:43:26 +0000] "GET //localhost:31000/api/atlas/v2/entity/guid/fd7e87d2-2f9f-42ff-8e5e-573170666867 HTTP/1.1" 200 1506 "-" "Java/1.8.0_172"
127.0.0.1 - - [04/May/2018:12:43:26 +0000] "POST //localhost:31000/api/atlas/v2/entity/ HTTP/1.1" 200 195 "-" "Java/1.8.0_172"
127.0.0.1 - - [04/May/2018:12:43:26 +0000] "GET //localhost:31000/api/atlas/v2/entity/guid/fd7e87d2-2f9f-42ff-8e5e-573170666867 HTTP/1.1" 200 1524 "-" "Java/1.8.0_172"
127.0.0.1 - - [04/May/2018:12:43:26 +0000] "GET //localhost:31000/api/atlas/v2/entity/guid/fd7e87d2-2f9f-42ff-8e5e-573170666867 HTTP/1.1" 200 1524 "-" "Java/1.8.0_172"
127.0.0.1 - - [04/May/2018:12:43:26 +0000] "POST //localhost:31000/api/atlas/v2/entity/ HTTP/1.1" 200 195 "-" "Java/1.8.0_172"
127.0.0.1 - - [04/May/2018:12:43:26 +0000] "GET //localhost:31000/api/atlas/v2/entity/guid/fd7e87d2-2f9f-42ff-8e5e-573170666867 HTTP/1.1" 200 1536 "-" "Java/1.8.0_172"
127.0.0.1 - - [04/May/2018:12:43:26 +0000] "GET //localhost:31000/api/atlas/v2/entity/guid/fd7e87d2-2f9f-42ff-8e5e-573170666867 HTTP/1.1" 200 1536 "-" "Java/1.8.0_172"
127.0.0.1 - - [04/May/2018:12:43:26 +0000] "POST //localhost:31000/api/atlas/v2/entity/ HTTP/1.1" 200 513 "-" "Java/1.8.0_172"
127.0.0.1 - - [04/May/2018:12:43:26 +0000] "GET //localhost:31000/api/atlas/v2/entity/guid/fd7e87d2-2f9f-42ff-8e5e-573170666867 HTTP/1.1" 200 1674 "-" "Java/1.8.0_172"
127.0.0.1 - - [04/May/2018:12:43:26 +0000] "GET //localhost:31000/api/atlas/v2/types/typedef/name/PII_TraitBXU3SQUt7q HTTP/1.1" 404 96 "-" "Java/1.8.0_172"
127.0.0.1 - - [04/May/2018:12:43:26 +0000] "POST //localhost:31000/api/atlas/v2/types/typedefs/ HTTP/1.1" 200 576 "-" "Java/1.8.0_172"
127.0.0.1 - - [04/May/2018:12:43:27 +0000] "DELETE //localhost:31000/api/atlas/v2/entity/guid/fd7e87d2-2f9f-42ff-8e5e-573170666867/classification/PII_TraitBXU3SQUt7q HTTP/1.1" 400 114 "-" "Java/1.8.0_172"
127.0.0.1 - - [04/May/2018:12:43:27 +0000] "GET //localhost:31000/api/atlas/v2/types/typedef/name/PII_TraitCBDqSQcxht HTTP/1.1" 404 96 "-" "Java/1.8.0_172"
127.0.0.1 - - [04/May/2018:12:43:27 +0000] "POST //localhost:31000/api/atlas/v2/types/typedefs/ HTTP/1.1" 200 425 "-" "Java/1.8.0_172"
127.0.0.1 - - [04/May/2018:12:43:27 +0000] "GET //localhost:31000/api/atlas/v2/types/classificationdef/name/PII_TraitCBDqSQcxht HTTP/1.1" 200 332 "-" "Java/1.8.0_172"
127.0.0.1 - - [04/May/2018:12:43:27 +0000] "POST //localhost:31000/api/atlas/v2/entity/guid/fd7e87d2-2f9f-42ff-8e5e-573170666867/classifications HTTP/1.1" 204 0 "-" "Java/1.8.0_172"
127.0.0.1 - - [04/May/2018:12:43:27 +0000] "GET //localhost:31000/api/atlas/v2/entity/guid/fd7e87d2-2f9f-42ff-8e5e-573170666867/classifications HTTP/1.1" 200 868 "-" "Java/1.8.0_172"
127.0.0.1 - - [04/May/2018:12:43:27 +0000] "GET //localhost:31000/api/atlas/v2/entity/guid/fd7e87d2-2f9f-42ff-8e5e-573170666867/classifications HTTP/1.1" 200 868 "-" "Java/1.8.0_172"
127.0.0.1 - - [04/May/2018:12:43:27 +0000] "POST //localhost:31000/api/atlas/v2/entity/ HTTP/1.1" 200 579 "-" "Java/1.8.0_172"
127.0.0.1 - - [04/May/2018:12:43:27 +0000] "GET //localhost:31000/api/atlas/v2/entity/guid/fd7e87d2-2f9f-42ff-8e5e-573170666867 HTTP/1.1" 200 1854 "-" "Java/1.8.0_172"
127.0.0.1 - - [04/May/2018:12:43:27 +0000] "PUT //localhost:31000/api/atlas/v2/entity/uniqueAttribute/type/hive_table_v2?attr:qualifiedName=tableyRr5Y14rZf HTTP/1.1" 200 1170 "-" "Java/1.8.0_172"
127.0.0.1 - - [04/May/2018:12:43:27 +0000] "GET //localhost:31000/api/atlas/v2/entity/guid/fd7e87d2-2f9f-42ff-8e5e-573170666867 HTTP/1.1" 200 1930 "-" "Java/1.8.0_172"
127.0.0.1 - - [04/May/2018:12:43:27 +0000] "GET //localhost:31000/api/atlas/v2/types/typedef/name/PII_Traitpz3F1OR0Gb HTTP/1.1" 404 96 "-" "Java/1.8.0_172"
127.0.0.1 - - [04/May/2018:12:43:27 +0000] "POST //localhost:31000/api/atlas/v2/types/typedefs/ HTTP/1.1" 200 425 "-" "Java/1.8.0_172"
127.0.0.1 - - [04/May/2018:12:43:28 +0000] "POST //localhost:31000/api/atlas/v2/entity/guid/fd7e87d2-2f9f-42ff-8e5e-573170666867/classifications HTTP/1.1" 204 0 "-" "Java/1.8.0_172"
127.0.0.1 - - [04/May/2018:12:43:28 +0000] "GET //localhost:31000/api/atlas/entities/fd7e87d2-2f9f-42ff-8e5e-573170666867/audit?count=100 HTTP/1.1" 200 21391 "-" "Java/1.8.0_172"
127.0.0.1 - - [04/May/2018:12:43:28 +0000] "GET //localhost:31000/api/atlas/v2/types/typedef/name/PII_TraituA3FQnKT03 HTTP/1.1" 404 96 "-" "Java/1.8.0_172"
127.0.0.1 - - [04/May/2018:12:43:28 +0000] "POST //localhost:31000/api/atlas/v2/types/typedefs/ HTTP/1.1" 200 576 "-" "Java/1.8.0_172"
127.0.0.1 - - [04/May/2018:12:43:28 +0000] "POST //localhost:31000/api/atlas/v2/entity/guid/fd7e87d2-2f9f-42ff-8e5e-573170666867/classifications HTTP/1.1" 204 0 "-" "Java/1.8.0_172"
127.0.0.1 - - [04/May/2018:12:43:29 +0000] "GET //localhost:31000/api/atlas/v2/entity/guid/fd7e87d2-2f9f-42ff-8e5e-573170666867 HTTP/1.1" 200 2166 "-" "Java/1.8.0_172"
127.0.0.1 - - [04/May/2018:12:43:29 +0000] "GET //localhost:31000/api/atlas/v2/types/typedef/name/PII_TraitTlmMUWlZtD HTTP/1.1" 404 96 "-" "Java/1.8.0_172"
127.0.0.1 - - [04/May/2018:12:43:29 +0000] "POST //localhost:31000/api/atlas/v2/types/typedefs/ HTTP/1.1" 200 425 "-" "Java/1.8.0_172"
127.0.0.1 - - [04/May/2018:12:43:29 +0000] "POST //localhost:31000/api/atlas/v2/entity/guid/fd7e87d2-2f9f-42ff-8e5e-573170666867/classifications HTTP/1.1" 204 0 "-" "Java/1.8.0_172"
127.0.0.1 - - [04/May/2018:12:43:29 +0000] "GET //localhost:31000/api/atlas/entities/fd7e87d2-2f9f-42ff-8e5e-573170666867/audit?count=100 HTTP/1.1" 200 22089 "-" "Java/1.8.0_172"
127.0.0.1 - - [04/May/2018:12:43:29 +0000] "GET //localhost:31000/api/atlas/v2/entity/guid/fd7e87d2-2f9f-42ff-8e5e-573170666867/classifications HTTP/1.1" 200 1315 "-" "Java/1.8.0_172"
127.0.0.1 - - [04/May/2018:12:43:29 +0000] "POST //localhost:31000/api/atlas/types HTTP/1.1" 201 103 "-" "Java/1.8.0_172"
127.0.0.1 - - [04/May/2018:12:43:29 +0000] "POST //localhost:31000/api/atlas/types HTTP/1.1" 409 48 "-" "Java/1.8.0_172"
127.0.0.1 - - [04/May/2018:12:43:29 +0000] "GET //localhost:31000/api/atlas/types/blah HTTP/1.1" 404 43 "-" "Java/1.8.0_172"
127.0.0.1 - - [04/May/2018:12:43:29 +0000] "GET //localhost:31000/api/atlas/v2/types/typedef/name/class_trait HTTP/1.1" 404 88 "-" "Java/1.8.0_172"
127.0.0.1 - - [04/May/2018:12:43:29 +0000] "POST //localhost:31000/api/atlas/types HTTP/1.1" 201 104 "-" "Java/1.8.0_172"
127.0.0.1 - - [04/May/2018:12:43:29 +0000] "GET //localhost:31000/api/atlas/v2/types/typedef/name/secure_trait HTTP/1.1" 404 89 "-" "Java/1.8.0_172"
127.0.0.1 - - [04/May/2018:12:43:29 +0000] "POST //localhost:31000/api/atlas/types HTTP/1.1" 201 105 "-" "Java/1.8.0_172"
127.0.0.1 - - [04/May/2018:12:43:30 +0000] "GET //localhost:31000/api/atlas/v2/types/typedef/name/pii_trait HTTP/1.1" 404 86 "-" "Java/1.8.0_172"
127.0.0.1 - - [04/May/2018:12:43:30 +0000] "POST //localhost:31000/api/atlas/types HTTP/1.1" 201 102 "-" "Java/1.8.0_172"
127.0.0.1 - - [04/May/2018:12:43:30 +0000] "GET //localhost:31000/api/atlas/v2/types/typedef/name/ssn_trait HTTP/1.1" 404 86 "-" "Java/1.8.0_172"
127.0.0.1 - - [04/May/2018:12:43:30 +0000] "POST //localhost:31000/api/atlas/types HTTP/1.1" 201 102 "-" "Java/1.8.0_172"
127.0.0.1 - - [04/May/2018:12:43:30 +0000] "GET //localhost:31000/api/atlas/v2/types/typedef/name/salary_trait HTTP/1.1" 404 89 "-" "Java/1.8.0_172"
127.0.0.1 - - [04/May/2018:12:43:30 +0000] "POST //localhost:31000/api/atlas/types HTTP/1.1" 201 105 "-" "Java/1.8.0_172"
127.0.0.1 - - [04/May/2018:12:43:30 +0000] "GET //localhost:31000/api/atlas/v2/types/typedef/name/sox_trait HTTP/1.1" 404 86 "-" "Java/1.8.0_172"
127.0.0.1 - - [04/May/2018:12:43:30 +0000] "POST //localhost:31000/api/atlas/types HTTP/1.1" 201 102 "-" "Java/1.8.0_172"
127.0.0.1 - - [04/May/2018:12:43:30 +0000] "GET //localhost:31000/api/atlas/types?type=TRAIT HTTP/1.1" 200 1082 "-" "Java/1.8.0_172"
127.0.0.1 - - [04/May/2018:12:43:30 +0000] "GET //localhost:31000/api/atlas/v2/types/typedef/name/AudFkwmPEUA HTTP/1.1" 404 88 "-" "Java/1.8.0_172"
127.0.0.1 - - [04/May/2018:12:43:30 +0000] "POST //localhost:31000/api/atlas/types HTTP/1.1" 201 104 "-" "Java/1.8.0_172"
127.0.0.1 - - [04/May/2018:12:43:30 +0000] "GET //localhost:31000/api/atlas/v2/types/typedef/name/A1kRMmb6DYKS HTTP/1.1" 404 89 "-" "Java/1.8.0_172"
127.0.0.1 - - [04/May/2018:12:43:30 +0000] "POST //localhost:31000/api/atlas/types HTTP/1.1" 201 105 "-" "Java/1.8.0_172"
127.0.0.1 - - [04/May/2018:12:43:30 +0000] "GET //localhost:31000/api/atlas/v2/types/typedef/name/BgFBsGIxW21 HTTP/1.1" 404 88 "-" "Java/1.8.0_172"
127.0.0.1 - - [04/May/2018:12:43:30 +0000] "POST //localhost:31000/api/atlas/types HTTP/1.1" 201 104 "-" "Java/1.8.0_172"
127.0.0.1 - - [04/May/2018:12:43:30 +0000] "GET //localhost:31000/api/atlas/v2/types/typedef/name/CxxqcT3daJ8 HTTP/1.1" 404 88 "-" "Java/1.8.0_172"
127.0.0.1 - - [04/May/2018:12:43:30 +0000] "POST //localhost:31000/api/atlas/types HTTP/1.1" 201 104 "-" "Java/1.8.0_172"
127.0.0.1 - - [04/May/2018:12:43:31 +0000] "GET //localhost:31000/api/atlas/types?type=CLASS&supertype=AudFkwmPEUA&notsupertype=BgFBsGIxW21 HTTP/1.1" 200 108 "-" "Java/1.8.0_172"
127.0.0.1 - - [04/May/2018:12:43:31 +0000] "GET //localhost:31000/api/atlas/types/database HTTP/1.1" 200 748 "-" "Java/1.8.0_172"
127.0.0.1 - - [04/May/2018:12:43:31 +0000] "GET //localhost:31000/api/atlas/types/table HTTP/1.1" 200 1725 "-" "Java/1.8.0_172"
127.0.0.1 - - [04/May/2018:12:43:31 +0000] "GET //localhost:31000/api/atlas/types/fetl HTTP/1.1" 200 539 "-" "Java/1.8.0_172"
127.0.0.1 - - [04/May/2018:12:43:31 +0000] "POST //localhost:31000/api/atlas/types HTTP/1.1" 201 103 "-" "Java/1.8.0_172"
127.0.0.1 - - [04/May/2018:12:43:31 +0000] "PUT //localhost:31000/api/atlas/types HTTP/1.1" 200 103 "-" "Java/1.8.0_172"
127.0.0.1 - - [04/May/2018:12:43:31 +0000] "GET //localhost:31000/api/atlas/types/v7hWI8iH8F HTTP/1.1" 200 754 "-" "Java/1.8.0_172"
127.0.0.1 - - [04/May/2018:12:43:31 +0000] "DELETE //localhost:31000/api/atlas/v2/entity/guid/fd7e87d2-2f9f-42ff-8e5e-573170666867/classification/PII_TraitTlmMUWlZtD HTTP/1.1" 204 0 "-" "Java/1.8.0_172"
127.0.0.1 - - [04/May/2018:12:43:31 +0000] "GET //localhost:31000/api/atlas/entities/fd7e87d2-2f9f-42ff-8e5e-573170666867/audit?count=100 HTTP/1.1" 200 22320 "-" "Java/1.8.0_172"
127.0.0.1 - - [04/May/2018:12:43:31 +0000] "GET //localhost:31000/api/atlas/types/database HTTP/1.1" 200 748 "-" "Java/1.8.0_172"
127.0.0.1 - - [04/May/2018:12:43:31 +0000] "GET //localhost:31000/api/atlas/types/table HTTP/1.1" 200 1725 "-" "Java/1.8.0_172"
127.0.0.1 - - [04/May/2018:12:43:31 +0000] "GET //localhost:31000/api/atlas/types/fetl HTTP/1.1" 200 539 "-" "Java/1.8.0_172"
127.0.0.1 - - [04/May/2018:12:43:31 +0000] "GET //localhost:31000/api/atlas/types HTTP/1.1" 200 2518 "-" "Java/1.8.0_172"
Tests run: 119, Failures: 1, Errors: 0, Skipped: 0, Time elapsed: 151.687 sec <<< FAILURE! - in TestSuite
testAddReferenceProperty(org.apache.atlas.web.integration.EntityJerseyResourceIT)  Time elapsed: 0.792 sec  <<< FAILURE!
java.lang.AssertionError: expected [2] but found [3]
	at org.testng.Assert.fail(Assert.java:94)
	at org.testng.Assert.failNotEquals(Assert.java:496)
	at org.testng.Assert.assertEquals(Assert.java:125)
	at org.testng.Assert.assertEquals(Assert.java:372)
	at org.testng.Assert.assertEquals(Assert.java:382)
	at org.apache.atlas.web.integration.EntityJerseyResourceIT.testAddReferenceProperty(EntityJerseyResourceIT.java:437)


Results :

Failed tests: 
  EntityJerseyResourceIT.testAddReferenceProperty:437 expected [2] but found [3]

Tests run: 119, Failures: 1, Errors: 0, Skipped: 0

[INFO] 
[INFO] --- jetty-maven-plugin:9.3.14.v20161028:stop (stop-jetty) @ atlas-webapp ---
[INFO] Waiting 10 seconds for jetty to stop
[INFO] Stopped ServerConnector@6d21cce7{HTTP/1.1,[http/1.1]}{0.0.0.0:31000}
[INFO] Closing Spring root WebApplicationContext
[INFO] Shutting down log4j
[INFO] Stopped o.e.j.m.p.JettyWebAppContext@3b99d9df{/,file://<https://builds.apache.org/job/Atlas-master-IntegrationTests/ws/webapp/target/atlas-webapp-1.0.0-SNAPSHOT/,UNAVAILABLE}{/home/jenkins/jenkins-slave/workspace/Atlas-master-IntegrationTests/webapp/target/atlas-webapp-1.0.0-SNAPSHOT.war}>
[INFO] Server reports itself as stopped
[INFO] 
[INFO] --- maven-source-plugin:2.4:jar-no-fork (attach-sources) @ atlas-webapp ---
[INFO] Building jar: <https://builds.apache.org/job/Atlas-master-IntegrationTests/ws/webapp/target/atlas-webapp-1.0.0-SNAPSHOT-sources.jar>
log4j:WARN No appenders could be found for logger (org.apache.zookeeper.ClientCnxn).
log4j:WARN Please initialize the log4j system properly.
log4j:WARN See http://logging.apache.org/log4j/1.2/faq.html#noconfig for more info.
[INFO] 
[INFO] --- maven-source-plugin:2.4:test-jar-no-fork (attach-sources) @ atlas-webapp ---
[INFO] Building jar: <https://builds.apache.org/job/Atlas-master-IntegrationTests/ws/webapp/target/atlas-webapp-1.0.0-SNAPSHOT-test-sources.jar>
[INFO] 
[INFO] --- maven-failsafe-plugin:2.18.1:verify (verify) @ atlas-webapp ---
[INFO] Failsafe report directory: <https://builds.apache.org/job/Atlas-master-IntegrationTests/ws/webapp/target/failsafe-reports>
[INFO] ------------------------------------------------------------------------
[INFO] Reactor Summary:
[INFO] 
[INFO] Apache Atlas Server Build Tools .................... SUCCESS [  0.742 s]
[INFO] apache-atlas ....................................... SUCCESS [  4.458 s]
[INFO] Apache Atlas Test Utility Tools .................... SUCCESS [ 12.551 s]
[INFO] Open Connector Framework (OCF) ..................... SUCCESS [ 11.358 s]
[INFO] Open Metadata Repository Services (OMRS) ........... SUCCESS [ 35.389 s]
[INFO] Open Metadata and Governance (OMAG) Server APIs .... SUCCESS [  8.147 s]
[INFO] Connected Asset Open Metadata Access Service (OMAS)  SUCCESS [  8.969 s]
[INFO] Asset Consumer Open Metadata Access Service (OMAS) . SUCCESS [  8.431 s]
[INFO] Open Metadata and Governance (OMAG) Server ......... SUCCESS [  4.707 s]
[INFO] Apache Atlas Integration ........................... SUCCESS [ 21.237 s]
[INFO] Apache Atlas Common ................................ SUCCESS [  7.986 s]
[INFO] Apache Atlas Client ................................ SUCCESS [  0.529 s]
[INFO] atlas-client-common ................................ SUCCESS [  7.793 s]
[INFO] atlas-client-v1 .................................... SUCCESS [  8.876 s]
[INFO] Apache Atlas Server API ............................ SUCCESS [  6.426 s]
[INFO] Apache Atlas Notification .......................... SUCCESS [ 12.297 s]
[INFO] atlas-client-v2 .................................... SUCCESS [  8.242 s]
[INFO] Apache Atlas Graph Database Projects ............... SUCCESS [  0.454 s]
[INFO] Apache Atlas Graph Database API .................... SUCCESS [  5.413 s]
[INFO] Graph Database Common Code ......................... SUCCESS [  6.621 s]
[INFO] Apache Atlas JanusGraph DB Impl .................... SUCCESS [ 23.751 s]
[INFO] Apache Atlas Graph Database Implementation Dependencies SUCCESS [  2.248 s]
[INFO] Shaded version of Apache hbase client .............. SUCCESS [  8.759 s]
[INFO] Shaded version of Apache hbase server .............. SUCCESS [ 21.510 s]
[INFO] Apache Atlas Authorization ......................... SUCCESS [  7.140 s]
[INFO] Apache Atlas Repository ............................ SUCCESS [ 37.985 s]
[INFO] Apache Atlas UI .................................... SUCCESS [01:47 min]
[INFO] Apache Atlas Web Application ....................... FAILURE [03:59 min]
[INFO] Apache Atlas Documentation ......................... SKIPPED
[INFO] Apache Atlas FileSystem Model ...................... SKIPPED
[INFO] Apache Atlas Plugin Classloader .................... SKIPPED
[INFO] Apache Atlas Hive Bridge Shim ...................... SKIPPED
[INFO] Apache Atlas Hive Bridge ........................... SKIPPED
[INFO] Apache Atlas Falcon Bridge Shim .................... SKIPPED
[INFO] Apache Atlas Falcon Bridge ......................... SKIPPED
[INFO] Apache Atlas Sqoop Bridge Shim ..................... SKIPPED
[INFO] Apache Atlas Sqoop Bridge .......................... SKIPPED
[INFO] Apache Atlas Storm Bridge Shim ..................... SKIPPED
[INFO] Apache Atlas Storm Bridge .......................... SKIPPED
[INFO] Apache Atlas Hbase Bridge Shim ..................... SKIPPED
[INFO] Apache Atlas Hbase Bridge .......................... SKIPPED
[INFO] Apache Atlas Kafka Bridge .......................... SKIPPED
[INFO] Apache Atlas Distribution .......................... SKIPPED
[INFO] ------------------------------------------------------------------------
[INFO] BUILD FAILURE
[INFO] ------------------------------------------------------------------------
[INFO] Total time: 10:30 min
[INFO] Finished at: 2018-05-04T12:43:53Z
[INFO] Final Memory: 379M/2433M
[INFO] ------------------------------------------------------------------------
[ERROR] Failed to execute goal org.apache.maven.plugins:maven-failsafe-plugin:2.18.1:verify (verify) on project atlas-webapp: There are test failures.
[ERROR] 
[ERROR] Please refer to <https://builds.apache.org/job/Atlas-master-IntegrationTests/ws/webapp/target/failsafe-reports> for the individual test results.
[ERROR] -> [Help 1]
[ERROR] 
[ERROR] To see the full stack trace of the errors, re-run Maven with the -e switch.
[ERROR] Re-run Maven using the -X switch to enable full debug logging.
[ERROR] 
[ERROR] For more information about the errors and possible solutions, please read the following articles:
[ERROR] [Help 1] http://cwiki.apache.org/confluence/display/MAVEN/MojoFailureException
[ERROR] 
[ERROR] After correcting the problems, you can resume the build with the command
[ERROR]   mvn <goals> -rf :atlas-webapp
Build step 'Execute shell' marked build as failure
[CHECKSTYLE] Collecting checkstyle analysis files...
[CHECKSTYLE] Searching for all files in <https://builds.apache.org/job/Atlas-master-IntegrationTests/ws/> that match the pattern **/target/checkstyle-result.xml
[CHECKSTYLE] Parsing 26 files in <https://builds.apache.org/job/Atlas-master-IntegrationTests/ws/>
[CHECKSTYLE] Successfully parsed file <https://builds.apache.org/job/Atlas-master-IntegrationTests/ws/authorization/target/checkstyle-result.xml> with 669 unique warnings and 0 duplicates.
[CHECKSTYLE] Successfully parsed file <https://builds.apache.org/job/Atlas-master-IntegrationTests/ws/client/client-v1/target/checkstyle-result.xml> with 1556 unique warnings and 0 duplicates.
[CHECKSTYLE] Successfully parsed file <https://builds.apache.org/job/Atlas-master-IntegrationTests/ws/client/client-v2/target/checkstyle-result.xml> with 1915 unique warnings and 0 duplicates.
[CHECKSTYLE] Successfully parsed file <https://builds.apache.org/job/Atlas-master-IntegrationTests/ws/client/common/target/checkstyle-result.xml> with 2406 unique warnings and 0 duplicates.
[CHECKSTYLE] Successfully parsed file <https://builds.apache.org/job/Atlas-master-IntegrationTests/ws/client/target/checkstyle-result.xml> with 2406 unique warnings and 0 duplicates.
[CHECKSTYLE] Successfully parsed file <https://builds.apache.org/job/Atlas-master-IntegrationTests/ws/common/target/checkstyle-result.xml> with 3462 unique warnings and 0 duplicates.
[CHECKSTYLE] Successfully parsed file <https://builds.apache.org/job/Atlas-master-IntegrationTests/ws/dashboardv2/target/checkstyle-result.xml> with 3462 unique warnings and 0 duplicates.
[CHECKSTYLE] Successfully parsed file <https://builds.apache.org/job/Atlas-master-IntegrationTests/ws/graphdb/api/target/checkstyle-result.xml> with 3762 unique warnings and 0 duplicates.
[CHECKSTYLE] Successfully parsed file <https://builds.apache.org/job/Atlas-master-IntegrationTests/ws/graphdb/common/target/checkstyle-result.xml> with 3988 unique warnings and 0 duplicates.
[CHECKSTYLE] Successfully parsed file <https://builds.apache.org/job/Atlas-master-IntegrationTests/ws/graphdb/graphdb-impls/target/checkstyle-result.xml> with 3988 unique warnings and 0 duplicates.
[CHECKSTYLE] Successfully parsed file <https://builds.apache.org/job/Atlas-master-IntegrationTests/ws/graphdb/janus/target/checkstyle-result.xml> with 5766 unique warnings and 0 duplicates.
[CHECKSTYLE] Successfully parsed file <https://builds.apache.org/job/Atlas-master-IntegrationTests/ws/graphdb/target/checkstyle-result.xml> with 5766 unique warnings and 0 duplicates.
[CHECKSTYLE] Successfully parsed file <https://builds.apache.org/job/Atlas-master-IntegrationTests/ws/intg/target/checkstyle-result.xml> with 17588 unique warnings and 0 duplicates.
[CHECKSTYLE] Successfully parsed file <https://builds.apache.org/job/Atlas-master-IntegrationTests/ws/notification/target/checkstyle-result.xml> with 18824 unique warnings and 0 duplicates.
[CHECKSTYLE] Successfully parsed file <https://builds.apache.org/job/Atlas-master-IntegrationTests/ws/om-fwk-ocf/target/checkstyle-result.xml> with 23865 unique warnings and 0 duplicates.
[CHECKSTYLE] Successfully parsed file <https://builds.apache.org/job/Atlas-master-IntegrationTests/ws/omag-api/target/checkstyle-result.xml> with 25420 unique warnings and 0 duplicates.
[CHECKSTYLE] Successfully parsed file <https://builds.apache.org/job/Atlas-master-IntegrationTests/ws/omag-server/target/checkstyle-result.xml> with 25429 unique warnings and 0 duplicates.
[CHECKSTYLE] Successfully parsed file <https://builds.apache.org/job/Atlas-master-IntegrationTests/ws/omas-assetconsumer/target/checkstyle-result.xml> with 28268 unique warnings and 0 duplicates.
[CHECKSTYLE] Successfully parsed file <https://builds.apache.org/job/Atlas-master-IntegrationTests/ws/omas-connectedasset/target/checkstyle-result.xml> with 31681 unique warnings and 0 duplicates.
[CHECKSTYLE] Successfully parsed file <https://builds.apache.org/job/Atlas-master-IntegrationTests/ws/omrs/target/checkstyle-result.xml> with 71652 unique warnings and 0 duplicates.
[CHECKSTYLE] Successfully parsed file <https://builds.apache.org/job/Atlas-master-IntegrationTests/ws/repository/target/checkstyle-result.xml> with 91549 unique warnings and 0 duplicates.
[CHECKSTYLE] Successfully parsed file <https://builds.apache.org/job/Atlas-master-IntegrationTests/ws/server-api/target/checkstyle-result.xml> with 91715 unique warnings and 0 duplicates.
[CHECKSTYLE] Successfully parsed file <https://builds.apache.org/job/Atlas-master-IntegrationTests/ws/shaded/hbase-client-shaded/target/checkstyle-result.xml> with 91715 unique warnings and 0 duplicates.
[CHECKSTYLE] Successfully parsed file <https://builds.apache.org/job/Atlas-master-IntegrationTests/ws/shaded/hbase-server-shaded/target/checkstyle-result.xml> with 91715 unique warnings and 0 duplicates.
[CHECKSTYLE] Successfully parsed file <https://builds.apache.org/job/Atlas-master-IntegrationTests/ws/target/checkstyle-result.xml> with 91715 unique warnings and 0 duplicates.
[CHECKSTYLE] Successfully parsed file <https://builds.apache.org/job/Atlas-master-IntegrationTests/ws/test-tools/target/checkstyle-result.xml> with 91753 unique warnings and 0 duplicates.
<Git Blamer> Using GitBlamer to create author and commit information for all warnings.
<Git Blamer> GIT_COMMIT=967bf67eb6858c91c97b13e2b1c60caa1d51299c, workspace=<https://builds.apache.org/job/Atlas-master-IntegrationTests/ws/>
 > git rev-parse 967bf67eb6858c91c97b13e2b1c60caa1d51299c^{commit} # timeout=10
[CHECKSTYLE] Computing warning deltas based on reference build #1238
[FINDBUGS] Collecting findbugs analysis files...
[FINDBUGS] Searching for all files in <https://builds.apache.org/job/Atlas-master-IntegrationTests/ws/> that match the pattern **/target/findbugs.xml
[FINDBUGS] Parsing 19 files in <https://builds.apache.org/job/Atlas-master-IntegrationTests/ws/>
[FINDBUGS] Successfully parsed file <https://builds.apache.org/job/Atlas-master-IntegrationTests/ws/authorization/target/findbugs.xml> with 0 unique warnings and 0 duplicates.
[FINDBUGS] Successfully parsed file <https://builds.apache.org/job/Atlas-master-IntegrationTests/ws/client/client-v1/target/findbugs.xml> with 0 unique warnings and 0 duplicates.
[FINDBUGS] Successfully parsed file <https://builds.apache.org/job/Atlas-master-IntegrationTests/ws/client/client-v2/target/findbugs.xml> with 0 unique warnings and 0 duplicates.
[FINDBUGS] Successfully parsed file <https://builds.apache.org/job/Atlas-master-IntegrationTests/ws/client/common/target/findbugs.xml> with 0 unique warnings and 0 duplicates.
[FINDBUGS] Successfully parsed file <https://builds.apache.org/job/Atlas-master-IntegrationTests/ws/common/target/findbugs.xml> with 0 unique warnings and 0 duplicates.
[FINDBUGS] Successfully parsed file <https://builds.apache.org/job/Atlas-master-IntegrationTests/ws/graphdb/api/target/findbugs.xml> with 0 unique warnings and 0 duplicates.
[FINDBUGS] Successfully parsed file <https://builds.apache.org/job/Atlas-master-IntegrationTests/ws/graphdb/common/target/findbugs.xml> with 0 unique warnings and 0 duplicates.
[FINDBUGS] Successfully parsed file <https://builds.apache.org/job/Atlas-master-IntegrationTests/ws/graphdb/janus/target/findbugs.xml> with 0 unique warnings and 0 duplicates.
[FINDBUGS] Successfully parsed file <https://builds.apache.org/job/Atlas-master-IntegrationTests/ws/intg/target/findbugs.xml> with 0 unique warnings and 0 duplicates.
[FINDBUGS] Successfully parsed file <https://builds.apache.org/job/Atlas-master-IntegrationTests/ws/notification/target/findbugs.xml> with 0 unique warnings and 0 duplicates.
[FINDBUGS] Successfully parsed file <https://builds.apache.org/job/Atlas-master-IntegrationTests/ws/om-fwk-ocf/target/findbugs.xml> with 0 unique warnings and 0 duplicates.
[FINDBUGS] Successfully parsed file <https://builds.apache.org/job/Atlas-master-IntegrationTests/ws/omag-api/target/findbugs.xml> with 0 unique warnings and 0 duplicates.
[FINDBUGS] Successfully parsed file <https://builds.apache.org/job/Atlas-master-IntegrationTests/ws/omag-server/target/findbugs.xml> with 0 unique warnings and 0 duplicates.
[FINDBUGS] Successfully parsed file <https://builds.apache.org/job/Atlas-master-IntegrationTests/ws/omas-assetconsumer/target/findbugs.xml> with 0 unique warnings and 0 duplicates.
[FINDBUGS] Successfully parsed file <https://builds.apache.org/job/Atlas-master-IntegrationTests/ws/omas-connectedasset/target/findbugs.xml> with 0 unique warnings and 0 duplicates.
[FINDBUGS] Successfully parsed file <https://builds.apache.org/job/Atlas-master-IntegrationTests/ws/omrs/target/findbugs.xml> with 0 unique warnings and 0 duplicates.
[FINDBUGS] Successfully parsed file <https://builds.apache.org/job/Atlas-master-IntegrationTests/ws/repository/target/findbugs.xml> with 0 unique warnings and 0 duplicates.
[FINDBUGS] Successfully parsed file <https://builds.apache.org/job/Atlas-master-IntegrationTests/ws/server-api/target/findbugs.xml> with 0 unique warnings and 0 duplicates.
[FINDBUGS] Successfully parsed file <https://builds.apache.org/job/Atlas-master-IntegrationTests/ws/test-tools/target/findbugs.xml> with 0 unique warnings and 0 duplicates.
<Git Blamer> Using GitBlamer to create author and commit information for all warnings.
<Git Blamer> GIT_COMMIT=967bf67eb6858c91c97b13e2b1c60caa1d51299c, workspace=<https://builds.apache.org/job/Atlas-master-IntegrationTests/ws/>
[FINDBUGS] Computing warning deltas based on reference build #1238
Archiving artifacts
[Fast Archiver] Compressed 165.47 MB of artifacts by 84.2% relative to #1238
TestNG Reports Processing: START
Looking for TestNG results report in workspace using pattern: **/target/surefire-reports/testng-results.xml,**/target/failsafe-reports/testng-results.xml
Saving reports...
Processing '/x1/jenkins/jenkins-home/jobs/Atlas-master-IntegrationTests/builds/1241/testng/testng-results.xml'
0.840336% of tests failed, which exceeded threshold of 0%. Marking build as UNSTABLE
TestNG Reports Processing: FINISH