git.net

[Date Prev][Date Next][Thread Prev][Thread Next][Date Index][Thread Index]

Build failed in Jenkins: Atlas-master-IntegrationTests #1233


See <https://builds.apache.org/job/Atlas-master-IntegrationTests/1233/display/redirect?page=changes>

Changes:

[amestry] ATLAS-2641: Storm hook: Added commons-collection.

------------------------------------------
[...truncated 568.23 KB...]
127.0.0.1 - - [03/May/2018:20:42:56 +0000] "GET //localhost:31000/api/atlas/v2/types/typedef/name/hive_table_v1 HTTP/1.1" 200 1854 "-" "Java/1.8.0_172"
127.0.0.1 - - [03/May/2018:20:42:56 +0000] "GET //localhost:31000/api/atlas/v2/types/typedef/name/hive_process_v1 HTTP/1.1" 200 1401 "-" "Java/1.8.0_172"
127.0.0.1 - - [03/May/2018:20:42:56 +0000] "POST //localhost:31000/api/atlas/types HTTP/1.1" 201 192 "-" "Java/1.8.0_172"
127.0.0.1 - - [03/May/2018:20:42:57 +0000] "GET //localhost:31000/api/atlas/discovery/search/dsl?query=hive_db+where+qualifiedName%3D'dbqXMAEeqsnQ'&limit=10&offset=0 HTTP/1.1" 200 643 "-" "Java/1.8.0_172"
127.0.0.1 - - [03/May/2018:20:42:58 +0000] "GET //localhost:31000/api/atlas/entities?type=hive_db&property=qualifiedName&value=dbqXMAEeqsnQ HTTP/1.1" 200 723 "-" "Java/1.8.0_172"
127.0.0.1 - - [03/May/2018:20:42:58 +0000] "GET //localhost:31000/api/atlas/entities/dcea4252-d799-4140-999c-4c7b612b42ce/audit?count=1 HTTP/1.1" 200 1008 "-" "Java/1.8.0_172"
127.0.0.1 - - [03/May/2018:20:42:58 +0000] "POST //localhost:31000/api/atlas/entities HTTP/1.1" 201 881 "-" "Java/1.8.0_172"
127.0.0.1 - - [03/May/2018:20:42:59 +0000] "GET //localhost:31000/api/atlas/entities/fc719254-8ff8-4cc4-8b98-48e6519e52c9 HTTP/1.1" 200 721 "-" "Java/1.8.0_172"
127.0.0.1 - - [03/May/2018:20:43:01 +0000] "GET //localhost:31000/api/atlas/discovery/search/dsl?query=hive_db+where+name%3D'dbslWRD6QXAH'&limit=10&offset=0 HTTP/1.1" 200 634 "-" "Java/1.8.0_172"
127.0.0.1 - - [03/May/2018:20:43:02 +0000] "POST //localhost:31000/api/atlas/entities HTTP/1.1" 201 881 "-" "Java/1.8.0_172"
127.0.0.1 - - [03/May/2018:20:43:03 +0000] "GET //localhost:31000/api/atlas/discovery/search/dsl?query=hive_db+where+qualifiedName%3D'dbA5cIehgUg6'&limit=10&offset=0 HTTP/1.1" 200 646 "-" "Java/1.8.0_172"
127.0.0.1 - - [03/May/2018:20:43:03 +0000] "GET //localhost:31000/api/atlas/entities?type=hive_db&property=qualifiedName&value=dbA5cIehgUg6 HTTP/1.1" 200 726 "-" "Java/1.8.0_172"
127.0.0.1 - - [03/May/2018:20:43:03 +0000] "POST //localhost:31000/api/atlas/entities HTTP/1.1" 201 881 "-" "Java/1.8.0_172"
127.0.0.1 - - [03/May/2018:20:43:04 +0000] "GET //localhost:31000/api/atlas/entities?type=hive_db&property=qualifiedName&value=dbi4yrS6YqcF HTTP/1.1" 200 728 "-" "Java/1.8.0_172"
127.0.0.1 - - [03/May/2018:20:43:04 +0000] "GET //localhost:31000/api/atlas/entities?type=hive_db&property=qualifiedName&value=dbi4yrS6YqcF HTTP/1.1" 200 728 "-" "Java/1.8.0_172"
127.0.0.1 - - [03/May/2018:20:43:04 +0000] "POST //localhost:31000/api/atlas/entities HTTP/1.1" 201 881 "-" "Java/1.8.0_172"
127.0.0.1 - - [03/May/2018:20:43:05 +0000] "GET //localhost:31000/api/atlas/discovery/search/dsl?query=hive_db+where+qualifiedName%3D'dbnKk6j6AI9Q'&limit=10&offset=0 HTTP/1.1" 200 640 "-" "Java/1.8.0_172"
127.0.0.1 - - [03/May/2018:20:43:06 +0000] "GET //localhost:31000/api/atlas/discovery/search/dsl?query=hive_db+where+qualifiedName%3D'dbiOcsfC0BJy'&limit=10&offset=0 HTTP/1.1" 200 184 "-" "Java/1.8.0_172"
127.0.0.1 - - [03/May/2018:20:43:06 +0000] "GET //localhost:31000/api/atlas/v2/types/typedef/name/PII_Traitn97S8Mbzih HTTP/1.1" 404 96 "-" "Java/1.8.0_172"
127.0.0.1 - - [03/May/2018:20:43:06 +0000] "POST //localhost:31000/api/atlas/v2/types/typedefs/ HTTP/1.1" 200 425 "-" "Java/1.8.0_172"
127.0.0.1 - - [03/May/2018:20:43:06 +0000] "POST //localhost:31000/api/atlas/v2/entity/guid/9a7ea93b-bb0c-4867-b5a5-5a3f11b645f4/classifications HTTP/1.1" 204 0 "-" "Java/1.8.0_172"
127.0.0.1 - - [03/May/2018:20:43:07 +0000] "GET //localhost:31000/api/atlas/entities/9a7ea93b-bb0c-4867-b5a5-5a3f11b645f4/audit?count=100 HTTP/1.1" 200 21392 "-" "Java/1.8.0_172"
127.0.0.1 - - [03/May/2018:20:43:07 +0000] "GET //localhost:31000/api/atlas/v2/types/typedef/name/PII_TraitoUcRwKBLz1 HTTP/1.1" 404 96 "-" "Java/1.8.0_172"
127.0.0.1 - - [03/May/2018:20:43:07 +0000] "POST //localhost:31000/api/atlas/v2/types/typedefs/ HTTP/1.1" 200 576 "-" "Java/1.8.0_172"
127.0.0.1 - - [03/May/2018:20:43:07 +0000] "POST //localhost:31000/api/atlas/v2/entity/guid/9a7ea93b-bb0c-4867-b5a5-5a3f11b645f4/classifications HTTP/1.1" 204 0 "-" "Java/1.8.0_172"
127.0.0.1 - - [03/May/2018:20:43:08 +0000] "GET //localhost:31000/api/atlas/v2/entity/guid/9a7ea93b-bb0c-4867-b5a5-5a3f11b645f4 HTTP/1.1" 200 2166 "-" "Java/1.8.0_172"
127.0.0.1 - - [03/May/2018:20:43:08 +0000] "GET //localhost:31000/api/atlas/v2/types/typedef/name/PII_TraitPRdKVWZtSy HTTP/1.1" 404 96 "-" "Java/1.8.0_172"
127.0.0.1 - - [03/May/2018:20:43:08 +0000] "POST //localhost:31000/api/atlas/v2/types/typedefs/ HTTP/1.1" 200 425 "-" "Java/1.8.0_172"
127.0.0.1 - - [03/May/2018:20:43:08 +0000] "POST //localhost:31000/api/atlas/v2/entity/guid/9a7ea93b-bb0c-4867-b5a5-5a3f11b645f4/classifications HTTP/1.1" 204 0 "-" "Java/1.8.0_172"
127.0.0.1 - - [03/May/2018:20:43:08 +0000] "GET //localhost:31000/api/atlas/entities/9a7ea93b-bb0c-4867-b5a5-5a3f11b645f4/audit?count=100 HTTP/1.1" 200 22090 "-" "Java/1.8.0_172"
127.0.0.1 - - [03/May/2018:20:43:08 +0000] "GET //localhost:31000/api/atlas/v2/entity/guid/9a7ea93b-bb0c-4867-b5a5-5a3f11b645f4/classifications HTTP/1.1" 200 1315 "-" "Java/1.8.0_172"
127.0.0.1 - - [03/May/2018:20:43:08 +0000] "DELETE //localhost:31000/api/atlas/v2/entity/guid/9a7ea93b-bb0c-4867-b5a5-5a3f11b645f4/classification/PII_TraitPRdKVWZtSy HTTP/1.1" 204 0 "-" "Java/1.8.0_172"
127.0.0.1 - - [03/May/2018:20:43:08 +0000] "GET //localhost:31000/api/atlas/entities/9a7ea93b-bb0c-4867-b5a5-5a3f11b645f4/audit?count=100 HTTP/1.1" 200 22321 "-" "Java/1.8.0_172"
Tests run: 123, Failures: 4, Errors: 0, Skipped: 0, Time elapsed: 170.421 sec <<< FAILURE! - in TestSuite
testEnterEmptyValues(org.apache.atlas.CredentialProviderUtilityIT)  Time elapsed: 0.842 sec  <<< FAILURE!
java.io.IOException: Invalid secret key format
	at com.sun.crypto.provider.JceKeyStore.engineLoad(JceKeyStore.java:856)
	at java.security.KeyStore.load(KeyStore.java:1445)
	at org.apache.hadoop.security.alias.AbstractJavaKeyStoreProvider.<init>(AbstractJavaKeyStoreProvider.java:106)
	at org.apache.hadoop.security.alias.JavaKeyStoreProvider.<init>(JavaKeyStoreProvider.java:49)
	at org.apache.hadoop.security.alias.JavaKeyStoreProvider.<init>(JavaKeyStoreProvider.java:41)
	at org.apache.hadoop.security.alias.JavaKeyStoreProvider$Factory.createProvider(JavaKeyStoreProvider.java:100)
	at org.apache.hadoop.security.alias.CredentialProviderFactory.getProviders(CredentialProviderFactory.java:58)
	at org.apache.atlas.CredentialProviderUtilityIT.testEnterEmptyValues(CredentialProviderUtilityIT.java:138)

testEnterMismatchedValues(org.apache.atlas.CredentialProviderUtilityIT)  Time elapsed: 0.653 sec  <<< FAILURE!
java.io.IOException: Invalid secret key format
	at com.sun.crypto.provider.JceKeyStore.engineLoad(JceKeyStore.java:856)
	at java.security.KeyStore.load(KeyStore.java:1445)
	at org.apache.hadoop.security.alias.AbstractJavaKeyStoreProvider.<init>(AbstractJavaKeyStoreProvider.java:106)
	at org.apache.hadoop.security.alias.JavaKeyStoreProvider.<init>(JavaKeyStoreProvider.java:49)
	at org.apache.hadoop.security.alias.JavaKeyStoreProvider.<init>(JavaKeyStoreProvider.java:41)
	at org.apache.hadoop.security.alias.JavaKeyStoreProvider$Factory.createProvider(JavaKeyStoreProvider.java:100)
	at org.apache.hadoop.security.alias.CredentialProviderFactory.getProviders(CredentialProviderFactory.java:58)
	at org.apache.atlas.CredentialProviderUtilityIT.testEnterMismatchedValues(CredentialProviderUtilityIT.java:192)

testEnterValidValues(org.apache.atlas.CredentialProviderUtilityIT)  Time elapsed: 0.59 sec  <<< FAILURE!
java.io.IOException: Invalid secret key format
	at com.sun.crypto.provider.JceKeyStore.engineLoad(JceKeyStore.java:856)
	at java.security.KeyStore.load(KeyStore.java:1445)
	at org.apache.hadoop.security.alias.AbstractJavaKeyStoreProvider.<init>(AbstractJavaKeyStoreProvider.java:106)
	at org.apache.hadoop.security.alias.JavaKeyStoreProvider.<init>(JavaKeyStoreProvider.java:49)
	at org.apache.hadoop.security.alias.JavaKeyStoreProvider.<init>(JavaKeyStoreProvider.java:41)
	at org.apache.hadoop.security.alias.JavaKeyStoreProvider$Factory.createProvider(JavaKeyStoreProvider.java:100)
	at org.apache.hadoop.security.alias.CredentialProviderFactory.getProviders(CredentialProviderFactory.java:58)
	at org.apache.atlas.CredentialProviderUtilityIT.testEnterValidValues(CredentialProviderUtilityIT.java:76)

testOverwriteValues(org.apache.atlas.CredentialProviderUtilityIT)  Time elapsed: 0.654 sec  <<< FAILURE!
java.io.IOException: Invalid secret key format
	at com.sun.crypto.provider.JceKeyStore.engineLoad(JceKeyStore.java:856)
	at java.security.KeyStore.load(KeyStore.java:1445)
	at org.apache.hadoop.security.alias.AbstractJavaKeyStoreProvider.<init>(AbstractJavaKeyStoreProvider.java:106)
	at org.apache.hadoop.security.alias.JavaKeyStoreProvider.<init>(JavaKeyStoreProvider.java:49)
	at org.apache.hadoop.security.alias.JavaKeyStoreProvider.<init>(JavaKeyStoreProvider.java:41)
	at org.apache.hadoop.security.alias.JavaKeyStoreProvider$Factory.createProvider(JavaKeyStoreProvider.java:100)
	at org.apache.hadoop.security.alias.CredentialProviderFactory.getProviders(CredentialProviderFactory.java:58)
	at org.apache.atlas.util.CredentialProviderUtility.getCredentialProvider(CredentialProviderUtility.java:150)
	at org.apache.atlas.util.CredentialProviderUtility.main(CredentialProviderUtility.java:75)
	at org.apache.atlas.CredentialProviderUtilityIT.testOverwriteValues(CredentialProviderUtilityIT.java:251)


Results :

Failed tests: 
  CredentialProviderUtilityIT.testEnterEmptyValues:138 » IO Invalid secret key f...
  CredentialProviderUtilityIT.testEnterMismatchedValues:192 » IO Invalid secret ...
  CredentialProviderUtilityIT.testEnterValidValues:76 » IO Invalid secret key fo...
  CredentialProviderUtilityIT.testOverwriteValues:251 » IO Invalid secret key fo...

Tests run: 123, Failures: 4, Errors: 0, Skipped: 0

[INFO] 
[INFO] --- jetty-maven-plugin:9.3.14.v20161028:stop (stop-jetty) @ atlas-webapp ---
[INFO] Waiting 10 seconds for jetty to stop
[INFO] Stopped ServerConnector@279f0ad3{HTTP/1.1,[http/1.1]}{0.0.0.0:31000}
[INFO] Closing Spring root WebApplicationContext
[INFO] Shutting down log4j
[INFO] Stopped o.e.j.m.p.JettyWebAppContext@2c36613c{/,file://<https://builds.apache.org/job/Atlas-master-IntegrationTests/ws/webapp/target/atlas-webapp-1.0.0-SNAPSHOT/,UNAVAILABLE}{/home/jenkins/jenkins-slave/workspace/Atlas-master-IntegrationTests/webapp/target/atlas-webapp-1.0.0-SNAPSHOT.war}>
[INFO] Server reports itself as stopped
[INFO] 
[INFO] --- maven-source-plugin:2.4:jar-no-fork (attach-sources) @ atlas-webapp ---
[INFO] Building jar: <https://builds.apache.org/job/Atlas-master-IntegrationTests/ws/webapp/target/atlas-webapp-1.0.0-SNAPSHOT-sources.jar>
log4j:WARN No appenders could be found for logger (org.apache.zookeeper.ClientCnxn).
log4j:WARN Please initialize the log4j system properly.
log4j:WARN See http://logging.apache.org/log4j/1.2/faq.html#noconfig for more info.
[INFO] 
[INFO] --- maven-source-plugin:2.4:test-jar-no-fork (attach-sources) @ atlas-webapp ---
[INFO] Building jar: <https://builds.apache.org/job/Atlas-master-IntegrationTests/ws/webapp/target/atlas-webapp-1.0.0-SNAPSHOT-test-sources.jar>
[INFO] 
[INFO] --- maven-failsafe-plugin:2.18.1:verify (verify) @ atlas-webapp ---
[INFO] Failsafe report directory: <https://builds.apache.org/job/Atlas-master-IntegrationTests/ws/webapp/target/failsafe-reports>
[INFO] ------------------------------------------------------------------------
[INFO] Reactor Summary:
[INFO] 
[INFO] Apache Atlas Server Build Tools .................... SUCCESS [  0.536 s]
[INFO] apache-atlas ....................................... SUCCESS [  3.787 s]
[INFO] Apache Atlas Test Utility Tools .................... SUCCESS [  9.852 s]
[INFO] Open Connector Framework (OCF) ..................... SUCCESS [ 10.044 s]
[INFO] Open Metadata Repository Services (OMRS) ........... SUCCESS [ 30.679 s]
[INFO] Open Metadata and Governance (OMAG) Server APIs .... SUCCESS [  6.704 s]
[INFO] Connected Asset Open Metadata Access Service (OMAS)  SUCCESS [  7.513 s]
[INFO] Asset Consumer Open Metadata Access Service (OMAS) . SUCCESS [  7.523 s]
[INFO] Open Metadata and Governance (OMAG) Server ......... SUCCESS [  4.538 s]
[INFO] Apache Atlas Integration ........................... SUCCESS [ 17.098 s]
[INFO] Apache Atlas Common ................................ SUCCESS [  7.075 s]
[INFO] Apache Atlas Client ................................ SUCCESS [  0.446 s]
[INFO] atlas-client-common ................................ SUCCESS [  6.230 s]
[INFO] atlas-client-v1 .................................... SUCCESS [  6.184 s]
[INFO] Apache Atlas Server API ............................ SUCCESS [  5.534 s]
[INFO] Apache Atlas Notification .......................... SUCCESS [  8.316 s]
[INFO] atlas-client-v2 .................................... SUCCESS [  5.463 s]
[INFO] Apache Atlas Graph Database Projects ............... SUCCESS [  0.518 s]
[INFO] Apache Atlas Graph Database API .................... SUCCESS [  4.594 s]
[INFO] Graph Database Common Code ......................... SUCCESS [  5.090 s]
[INFO] Apache Atlas JanusGraph DB Impl .................... SUCCESS [ 12.795 s]
[INFO] Apache Atlas Graph Database Implementation Dependencies SUCCESS [  2.159 s]
[INFO] Shaded version of Apache hbase client .............. SUCCESS [  7.668 s]
[INFO] Apache Atlas Titan 0.5.4 Graph DB Impl ............. SUCCESS [ 36.072 s]
[INFO] Shaded version of Apache hbase server .............. SUCCESS [ 19.293 s]
[INFO] Apache Atlas Authorization ......................... SUCCESS [  6.393 s]
[INFO] Apache Atlas Repository ............................ SUCCESS [ 29.592 s]
[INFO] Apache Atlas UI .................................... SUCCESS [01:30 min]
[INFO] Apache Atlas Web Application ....................... FAILURE [04:03 min]
[INFO] Apache Atlas Documentation ......................... SKIPPED
[INFO] Apache Atlas FileSystem Model ...................... SKIPPED
[INFO] Apache Atlas Plugin Classloader .................... SKIPPED
[INFO] Apache Atlas Hive Bridge Shim ...................... SKIPPED
[INFO] Apache Atlas Hive Bridge ........................... SKIPPED
[INFO] Apache Atlas Falcon Bridge Shim .................... SKIPPED
[INFO] Apache Atlas Falcon Bridge ......................... SKIPPED
[INFO] Apache Atlas Sqoop Bridge Shim ..................... SKIPPED
[INFO] Apache Atlas Sqoop Bridge .......................... SKIPPED
[INFO] Apache Atlas Storm Bridge Shim ..................... SKIPPED
[INFO] Apache Atlas Storm Bridge .......................... SKIPPED
[INFO] Apache Atlas Hbase Bridge Shim ..................... SKIPPED
[INFO] Apache Atlas Hbase Bridge .......................... SKIPPED
[INFO] Apache Atlas Kafka Bridge .......................... SKIPPED
[INFO] Apache Atlas Migration Exporter .................... SKIPPED
[INFO] Apache Atlas Distribution .......................... SKIPPED
[INFO] ------------------------------------------------------------------------
[INFO] BUILD FAILURE
[INFO] ------------------------------------------------------------------------
[INFO] Total time: 09:56 min
[INFO] Finished at: 2018-05-03T20:43:14Z
[INFO] Final Memory: 390M/3022M
[INFO] ------------------------------------------------------------------------
[ERROR] Failed to execute goal org.apache.maven.plugins:maven-failsafe-plugin:2.18.1:verify (verify) on project atlas-webapp: There are test failures.
[ERROR] 
[ERROR] Please refer to <https://builds.apache.org/job/Atlas-master-IntegrationTests/ws/webapp/target/failsafe-reports> for the individual test results.
[ERROR] -> [Help 1]
[ERROR] 
[ERROR] To see the full stack trace of the errors, re-run Maven with the -e switch.
[ERROR] Re-run Maven using the -X switch to enable full debug logging.
[ERROR] 
[ERROR] For more information about the errors and possible solutions, please read the following articles:
[ERROR] [Help 1] http://cwiki.apache.org/confluence/display/MAVEN/MojoFailureException
[ERROR] 
[ERROR] After correcting the problems, you can resume the build with the command
[ERROR]   mvn <goals> -rf :atlas-webapp
Build step 'Execute shell' marked build as failure
[CHECKSTYLE] Collecting checkstyle analysis files...
[CHECKSTYLE] Searching for all files in <https://builds.apache.org/job/Atlas-master-IntegrationTests/ws/> that match the pattern **/target/checkstyle-result.xml
[CHECKSTYLE] Parsing 27 files in <https://builds.apache.org/job/Atlas-master-IntegrationTests/ws/>
[CHECKSTYLE] Successfully parsed file <https://builds.apache.org/job/Atlas-master-IntegrationTests/ws/authorization/target/checkstyle-result.xml> with 669 unique warnings and 0 duplicates.
[CHECKSTYLE] Successfully parsed file <https://builds.apache.org/job/Atlas-master-IntegrationTests/ws/client/client-v1/target/checkstyle-result.xml> with 1556 unique warnings and 0 duplicates.
[CHECKSTYLE] Successfully parsed file <https://builds.apache.org/job/Atlas-master-IntegrationTests/ws/client/client-v2/target/checkstyle-result.xml> with 1915 unique warnings and 0 duplicates.
[CHECKSTYLE] Successfully parsed file <https://builds.apache.org/job/Atlas-master-IntegrationTests/ws/client/common/target/checkstyle-result.xml> with 2406 unique warnings and 0 duplicates.
[CHECKSTYLE] Successfully parsed file <https://builds.apache.org/job/Atlas-master-IntegrationTests/ws/client/target/checkstyle-result.xml> with 2406 unique warnings and 0 duplicates.
[CHECKSTYLE] Successfully parsed file <https://builds.apache.org/job/Atlas-master-IntegrationTests/ws/common/target/checkstyle-result.xml> with 3463 unique warnings and 0 duplicates.
[CHECKSTYLE] Successfully parsed file <https://builds.apache.org/job/Atlas-master-IntegrationTests/ws/dashboardv2/target/checkstyle-result.xml> with 3463 unique warnings and 0 duplicates.
[CHECKSTYLE] Successfully parsed file <https://builds.apache.org/job/Atlas-master-IntegrationTests/ws/graphdb/api/target/checkstyle-result.xml> with 3763 unique warnings and 0 duplicates.
[CHECKSTYLE] Successfully parsed file <https://builds.apache.org/job/Atlas-master-IntegrationTests/ws/graphdb/common/target/checkstyle-result.xml> with 3989 unique warnings and 0 duplicates.
[CHECKSTYLE] Successfully parsed file <https://builds.apache.org/job/Atlas-master-IntegrationTests/ws/graphdb/graphdb-impls/target/checkstyle-result.xml> with 3989 unique warnings and 0 duplicates.
[CHECKSTYLE] Successfully parsed file <https://builds.apache.org/job/Atlas-master-IntegrationTests/ws/graphdb/janus/target/checkstyle-result.xml> with 5767 unique warnings and 0 duplicates.
[CHECKSTYLE] Successfully parsed file <https://builds.apache.org/job/Atlas-master-IntegrationTests/ws/graphdb/target/checkstyle-result.xml> with 5767 unique warnings and 0 duplicates.
[CHECKSTYLE] Successfully parsed file <https://builds.apache.org/job/Atlas-master-IntegrationTests/ws/graphdb/titan0/target/checkstyle-result.xml> with 8271 unique warnings and 0 duplicates.
[CHECKSTYLE] Successfully parsed file <https://builds.apache.org/job/Atlas-master-IntegrationTests/ws/intg/target/checkstyle-result.xml> with 20093 unique warnings and 0 duplicates.
[CHECKSTYLE] Successfully parsed file <https://builds.apache.org/job/Atlas-master-IntegrationTests/ws/notification/target/checkstyle-result.xml> with 21329 unique warnings and 0 duplicates.
[CHECKSTYLE] Successfully parsed file <https://builds.apache.org/job/Atlas-master-IntegrationTests/ws/om-fwk-ocf/target/checkstyle-result.xml> with 26370 unique warnings and 0 duplicates.
[CHECKSTYLE] Successfully parsed file <https://builds.apache.org/job/Atlas-master-IntegrationTests/ws/omag-api/target/checkstyle-result.xml> with 27925 unique warnings and 0 duplicates.
[CHECKSTYLE] Successfully parsed file <https://builds.apache.org/job/Atlas-master-IntegrationTests/ws/omag-server/target/checkstyle-result.xml> with 27934 unique warnings and 0 duplicates.
[CHECKSTYLE] Successfully parsed file <https://builds.apache.org/job/Atlas-master-IntegrationTests/ws/omas-assetconsumer/target/checkstyle-result.xml> with 30773 unique warnings and 0 duplicates.
[CHECKSTYLE] Successfully parsed file <https://builds.apache.org/job/Atlas-master-IntegrationTests/ws/omas-connectedasset/target/checkstyle-result.xml> with 34186 unique warnings and 0 duplicates.
[CHECKSTYLE] Successfully parsed file <https://builds.apache.org/job/Atlas-master-IntegrationTests/ws/omrs/target/checkstyle-result.xml> with 74157 unique warnings and 0 duplicates.
[CHECKSTYLE] Successfully parsed file <https://builds.apache.org/job/Atlas-master-IntegrationTests/ws/repository/target/checkstyle-result.xml> with 94012 unique warnings and 0 duplicates.
[CHECKSTYLE] Successfully parsed file <https://builds.apache.org/job/Atlas-master-IntegrationTests/ws/server-api/target/checkstyle-result.xml> with 94178 unique warnings and 0 duplicates.
[CHECKSTYLE] Successfully parsed file <https://builds.apache.org/job/Atlas-master-IntegrationTests/ws/shaded/hbase-client-shaded/target/checkstyle-result.xml> with 94178 unique warnings and 0 duplicates.
[CHECKSTYLE] Successfully parsed file <https://builds.apache.org/job/Atlas-master-IntegrationTests/ws/shaded/hbase-server-shaded/target/checkstyle-result.xml> with 94178 unique warnings and 0 duplicates.
[CHECKSTYLE] Successfully parsed file <https://builds.apache.org/job/Atlas-master-IntegrationTests/ws/target/checkstyle-result.xml> with 94178 unique warnings and 0 duplicates.
[CHECKSTYLE] Successfully parsed file <https://builds.apache.org/job/Atlas-master-IntegrationTests/ws/test-tools/target/checkstyle-result.xml> with 94216 unique warnings and 0 duplicates.
<Git Blamer> Using GitBlamer to create author and commit information for all warnings.
<Git Blamer> GIT_COMMIT=b7f353b2a458984de30bf8e8cda89427cb524586, workspace=<https://builds.apache.org/job/Atlas-master-IntegrationTests/ws/>
 > git rev-parse b7f353b2a458984de30bf8e8cda89427cb524586^{commit} # timeout=10
<Git Blamer> Skipping file <https://builds.apache.org/job/Atlas-master-IntegrationTests/ws/repository/src/main/java/org/apache/atlas/discovery/SearchIndexer.java,> no result found.
[CHECKSTYLE] Computing warning deltas based on reference build #1179
[FINDBUGS] Collecting findbugs analysis files...
[FINDBUGS] Searching for all files in <https://builds.apache.org/job/Atlas-master-IntegrationTests/ws/> that match the pattern **/target/findbugs.xml
[FINDBUGS] Parsing 20 files in <https://builds.apache.org/job/Atlas-master-IntegrationTests/ws/>
[FINDBUGS] Successfully parsed file <https://builds.apache.org/job/Atlas-master-IntegrationTests/ws/authorization/target/findbugs.xml> with 0 unique warnings and 0 duplicates.
[FINDBUGS] Successfully parsed file <https://builds.apache.org/job/Atlas-master-IntegrationTests/ws/client/client-v1/target/findbugs.xml> with 0 unique warnings and 0 duplicates.
[FINDBUGS] Successfully parsed file <https://builds.apache.org/job/Atlas-master-IntegrationTests/ws/client/client-v2/target/findbugs.xml> with 0 unique warnings and 0 duplicates.
[FINDBUGS] Successfully parsed file <https://builds.apache.org/job/Atlas-master-IntegrationTests/ws/client/common/target/findbugs.xml> with 0 unique warnings and 0 duplicates.
[FINDBUGS] Successfully parsed file <https://builds.apache.org/job/Atlas-master-IntegrationTests/ws/common/target/findbugs.xml> with 0 unique warnings and 0 duplicates.
[FINDBUGS] Successfully parsed file <https://builds.apache.org/job/Atlas-master-IntegrationTests/ws/graphdb/api/target/findbugs.xml> with 0 unique warnings and 0 duplicates.
[FINDBUGS] Successfully parsed file <https://builds.apache.org/job/Atlas-master-IntegrationTests/ws/graphdb/common/target/findbugs.xml> with 0 unique warnings and 0 duplicates.
[FINDBUGS] Successfully parsed file <https://builds.apache.org/job/Atlas-master-IntegrationTests/ws/graphdb/janus/target/findbugs.xml> with 0 unique warnings and 0 duplicates.
[FINDBUGS] Successfully parsed file <https://builds.apache.org/job/Atlas-master-IntegrationTests/ws/graphdb/titan0/target/findbugs.xml> with 0 unique warnings and 0 duplicates.
[FINDBUGS] Successfully parsed file <https://builds.apache.org/job/Atlas-master-IntegrationTests/ws/intg/target/findbugs.xml> with 0 unique warnings and 0 duplicates.
[FINDBUGS] Successfully parsed file <https://builds.apache.org/job/Atlas-master-IntegrationTests/ws/notification/target/findbugs.xml> with 0 unique warnings and 0 duplicates.
[FINDBUGS] Successfully parsed file <https://builds.apache.org/job/Atlas-master-IntegrationTests/ws/om-fwk-ocf/target/findbugs.xml> with 0 unique warnings and 0 duplicates.
[FINDBUGS] Successfully parsed file <https://builds.apache.org/job/Atlas-master-IntegrationTests/ws/omag-api/target/findbugs.xml> with 0 unique warnings and 0 duplicates.
[FINDBUGS] Successfully parsed file <https://builds.apache.org/job/Atlas-master-IntegrationTests/ws/omag-server/target/findbugs.xml> with 0 unique warnings and 0 duplicates.
[FINDBUGS] Successfully parsed file <https://builds.apache.org/job/Atlas-master-IntegrationTests/ws/omas-assetconsumer/target/findbugs.xml> with 0 unique warnings and 0 duplicates.
[FINDBUGS] Successfully parsed file <https://builds.apache.org/job/Atlas-master-IntegrationTests/ws/omas-connectedasset/target/findbugs.xml> with 0 unique warnings and 0 duplicates.
[FINDBUGS] Successfully parsed file <https://builds.apache.org/job/Atlas-master-IntegrationTests/ws/omrs/target/findbugs.xml> with 0 unique warnings and 0 duplicates.
[FINDBUGS] Successfully parsed file <https://builds.apache.org/job/Atlas-master-IntegrationTests/ws/repository/target/findbugs.xml> with 0 unique warnings and 0 duplicates.
[FINDBUGS] Successfully parsed file <https://builds.apache.org/job/Atlas-master-IntegrationTests/ws/server-api/target/findbugs.xml> with 0 unique warnings and 0 duplicates.
[FINDBUGS] Successfully parsed file <https://builds.apache.org/job/Atlas-master-IntegrationTests/ws/test-tools/target/findbugs.xml> with 0 unique warnings and 0 duplicates.
<Git Blamer> Using GitBlamer to create author and commit information for all warnings.
<Git Blamer> GIT_COMMIT=b7f353b2a458984de30bf8e8cda89427cb524586, workspace=<https://builds.apache.org/job/Atlas-master-IntegrationTests/ws/>
[FINDBUGS] Computing warning deltas based on reference build #1179
Archiving artifacts
[Fast Archiver] Compressed 165.43 MB of artifacts by 84.2% relative to #1179
TestNG Reports Processing: START
Looking for TestNG results report in workspace using pattern: **/target/surefire-reports/testng-results.xml,**/target/failsafe-reports/testng-results.xml
Saving reports...
Processing '/x1/jenkins/jenkins-home/jobs/Atlas-master-IntegrationTests/builds/1233/testng/testng-results.xml'
3.252033% of tests failed, which exceeded threshold of 0%. Marking build as UNSTABLE
TestNG Reports Processing: FINISH