git.net

[Date Prev][Date Next][Thread Prev][Thread Next][Date Index][Thread Index]

Build failed in Jenkins: PreCommit-ATLAS-Build-Test #342-master-ATLAS-2521.1.patch


See <https://builds.apache.org/job/PreCommit-ATLAS-Build-Test/342/display/redirect>

------------------------------------------
[...truncated 458.76 KB...]
	at org.eclipse.jetty.servlet.ServletHandler.doHandle(ServletHandler.java:582)
	at org.eclipse.jetty.server.handler.ScopedHandler.handle(ScopedHandler.java:143)
	at org.eclipse.jetty.security.SecurityHandler.handle(SecurityHandler.java:548)
	at org.eclipse.jetty.server.session.SessionHandler.doHandle(SessionHandler.java:226)
	at org.eclipse.jetty.server.handler.ContextHandler.doHandle(ContextHandler.java:1180)
	at org.eclipse.jetty.servlet.ServletHandler.doScope(ServletHandler.java:512)
	at org.eclipse.jetty.server.session.SessionHandler.doScope(SessionHandler.java:185)
	at org.eclipse.jetty.server.handler.ContextHandler.doScope(ContextHandler.java:1112)
	at org.eclipse.jetty.server.handler.ScopedHandler.handle(ScopedHandler.java:141)
	at org.eclipse.jetty.server.handler.ContextHandlerCollection.handle(ContextHandlerCollection.java:213)
	at org.eclipse.jetty.server.handler.HandlerCollection.handle(HandlerCollection.java:119)
	at org.eclipse.jetty.server.handler.HandlerWrapper.handle(HandlerWrapper.java:134)
	at org.eclipse.jetty.server.Server.handle(Server.java:534)
	at org.eclipse.jetty.server.HttpChannel.handle(HttpChannel.java:320)
	at org.eclipse.jetty.server.HttpConnection.onFillable(HttpConnection.java:251)
	at org.eclipse.jetty.io.AbstractConnection$ReadCallback.succeeded(AbstractConnection.java:273)
	at org.eclipse.jetty.io.FillInterest.fillable(FillInterest.java:95)
	at org.eclipse.jetty.io.SelectChannelEndPoint$2.run(SelectChannelEndPoint.java:93)
	at org.eclipse.jetty.util.thread.strategy.ExecuteProduceConsume.executeProduceConsume(ExecuteProduceConsume.java:303)
	at org.eclipse.jetty.util.thread.strategy.ExecuteProduceConsume.produceConsume(ExecuteProduceConsume.java:148)
	at org.eclipse.jetty.util.thread.strategy.ExecuteProduceConsume.run(ExecuteProduceConsume.java:136)
	at org.eclipse.jetty.util.thread.QueuedThreadPool.runJob(QueuedThreadPool.java:671)
	at org.eclipse.jetty.util.thread.QueuedThreadPool$2.run(QueuedThreadPool.java:589)
	at java.lang.Thread.run(Thread.java:748)

127.0.0.1 - - [03/May/2018:19:21:21 +0000] "GET //localhost:31000/api/atlas/lineage/hive/table/SalesalziuEM7PY/schema HTTP/1.1" 500 100 "-" "Java/1.8.0_172"
127.0.0.1 - - [03/May/2018:19:21:21 +0000] "GET //localhost:31000/api/atlas/entities?type=hive_table_v1&property=qualifiedName&value=sales_factFdgiy6zK3M HTTP/1.1" 200 4368 "-" "Java/1.8.0_172"
127.0.0.1 - - [03/May/2018:19:21:21 +0000] "GET //localhost:31000/api/atlas/lineage/f11f7fed-217b-460f-a160-d5b378a4e4f8/schema HTTP/1.1" 200 3373 "-" "Java/1.8.0_172"
127.0.0.1 - - [03/May/2018:19:21:21 +0000] "POST //localhost:31000/api/atlas/entities HTTP/1.1" 201 882 "-" "Java/1.8.0_172"
127.0.0.1 - - [03/May/2018:19:21:22 +0000] "GET //localhost:31000/api/atlas/entities?type=hive_db&property=qualifiedName&value=dbi8hBnQDSD9 HTTP/1.1" 200 729 "-" "Java/1.8.0_172"
127.0.0.1 - - [03/May/2018:19:21:22 +0000] "GET //localhost:31000/api/atlas/entities?type=hive_db&property=qualifiedName&value=dbi8hBnQDSD9 HTTP/1.1" 200 729 "-" "Java/1.8.0_172"
127.0.0.1 - - [03/May/2018:19:21:22 +0000] "GET //localhost:31000/api/atlas/entities?type=hive_table_v1&property=qualifiedName&value=sales_factFdgiy6zK3M HTTP/1.1" 200 4368 "-" "Java/1.8.0_172"
127.0.0.1 - - [03/May/2018:19:21:22 +0000] "GET //localhost:31000/api/atlas/lineage/f11f7fed-217b-460f-a160-d5b378a4e4f8/outputs/graph HTTP/1.1" 200 1945 "-" "Java/1.8.0_172"
127.0.0.1 - - [03/May/2018:19:21:22 +0000] "GET //localhost:31000/api/atlas/entities?type=hive_table_v1&property=qualifiedName&value=sales_factFdgiy6zK3M HTTP/1.1" 200 4368 "-" "Java/1.8.0_172"
127.0.0.1 - - [03/May/2018:19:21:22 +0000] "GET //localhost:31000/api/atlas/lineage/f11f7fed-217b-460f-a160-d5b378a4e4f8/outputs/graph HTTP/1.1" 200 1945 "-" "Java/1.8.0_172"
127.0.0.1 - - [03/May/2018:19:21:22 +0000] "POST //localhost:31000/api/atlas/entities HTTP/1.1" 201 882 "-" "Java/1.8.0_172"
127.0.0.1 - - [03/May/2018:19:21:23 +0000] "GET //localhost:31000/api/atlas/discovery/search/dsl?query=hive_db+where+qualifiedName%3D'dbPJb5hqHQps'&limit=10&offset=0 HTTP/1.1" 200 641 "-" "Java/1.8.0_172"
127.0.0.1 - - [03/May/2018:19:21:24 +0000] "GET //localhost:31000/api/atlas/discovery/search/dsl?query=hive_db+where+qualifiedName%3D'dbVuvtMsVYae'&limit=10&offset=0 HTTP/1.1" 200 185 "-" "Java/1.8.0_172"
127.0.0.1 - - [03/May/2018:19:21:26 +0000] "GET //localhost:31000/api/atlas/discovery/search/dsl?query=hive_db+where+name%3D'dbcSS1AEbZtZ'&limit=10&offset=0 HTTP/1.1" 200 635 "-" "Java/1.8.0_172"
127.0.0.1 - - [03/May/2018:19:21:27 +0000] "GET //localhost:31000/api/atlas/entities?type=hive_table_v1&property=qualifiedName&value=sales_fact_monthly_mvDjxTqn9Txm HTTP/1.1" 200 4877 "-" "Java/1.8.0_172"
127.0.0.1 - - [03/May/2018:19:21:27 +0000] "GET //localhost:31000/api/atlas/lineage/d40d40e8-b198-4225-90d0-6f7de3e2ed96/inputs/graph HTTP/1.1" 200 2430 "-" "Java/1.8.0_172"
127.0.0.1 - - [03/May/2018:19:21:28 +0000] "GET //localhost:31000/api/atlas/discovery/search/dsl?query=hive_db+where+qualifiedName%3D'dbbbHWlDpzhA'&limit=10&offset=0 HTTP/1.1" 200 644 "-" "Java/1.8.0_172"
127.0.0.1 - - [03/May/2018:19:21:28 +0000] "GET //localhost:31000/api/atlas/entities?type=hive_db&property=qualifiedName&value=dbbbHWlDpzhA HTTP/1.1" 200 724 "-" "Java/1.8.0_172"
127.0.0.1 - - [03/May/2018:19:21:28 +0000] "GET //localhost:31000/api/atlas/entities/c7014b89-db63-44cc-acbd-75eb219b3f9f/audit?count=1 HTTP/1.1" 200 1009 "-" "Java/1.8.0_172"
127.0.0.1 - - [03/May/2018:19:21:28 +0000] "GET //localhost:31000/api/atlas/v2/types/typedef/name/database HTTP/1.1" 200 755 "-" "Java/1.8.0_172"
127.0.0.1 - - [03/May/2018:19:21:28 +0000] "GET //localhost:31000/api/atlas/v2/types/typedef/name/table HTTP/1.1" 200 1546 "-" "Java/1.8.0_172"
127.0.0.1 - - [03/May/2018:19:21:28 +0000] "GET //localhost:31000/api/atlas/v2/types/typedef/name/fetl HTTP/1.1" 200 451 "-" "Java/1.8.0_172"
127.0.0.1 - - [03/May/2018:19:21:28 +0000] "POST //localhost:31000/api/atlas/v2/types/typedefs/ HTTP/1.1" 200 93 "-" "Java/1.8.0_172"
127.0.0.1 - - [03/May/2018:19:21:28 +0000] "GET //localhost:31000/api/atlas/v2/types/classificationdef/name/fetl HTTP/1.1" 200 451 "-" "Java/1.8.0_172"
127.0.0.1 - - [03/May/2018:19:21:28 +0000] "GET //localhost:31000/api/atlas/v2/types/entitydef/name/database HTTP/1.1" 200 755 "-" "Java/1.8.0_172"
127.0.0.1 - - [03/May/2018:19:21:28 +0000] "GET //localhost:31000/api/atlas/v2/types/entitydef/name/table HTTP/1.1" 200 1546 "-" "Java/1.8.0_172"
127.0.0.1 - - [03/May/2018:19:21:28 +0000] "POST //localhost:31000/api/atlas/v2/types/typedefs/ HTTP/1.1" 200 532 "-" "Java/1.8.0_172"
127.0.0.1 - - [03/May/2018:19:21:29 +0000] "POST //localhost:31000/api/atlas/v2/types/typedefs/ HTTP/1.1" 409 86 "-" "Java/1.8.0_172"
127.0.0.1 - - [03/May/2018:19:21:29 +0000] "GET //localhost:31000/api/atlas/v2/types/enumdef/name/blah HTTP/1.1" 404 81 "-" "Java/1.8.0_172"
127.0.0.1 - - [03/May/2018:19:21:29 +0000] "GET //localhost:31000/api/atlas/v2/types/enumdef/guid/blah HTTP/1.1" 404 82 "-" "Java/1.8.0_172"
127.0.0.1 - - [03/May/2018:19:21:29 +0000] "GET //localhost:31000/api/atlas/v2/types/structdef/name/blah HTTP/1.1" 404 81 "-" "Java/1.8.0_172"
127.0.0.1 - - [03/May/2018:19:21:29 +0000] "GET //localhost:31000/api/atlas/v2/types/structdef/guid/blah HTTP/1.1" 404 82 "-" "Java/1.8.0_172"
127.0.0.1 - - [03/May/2018:19:21:29 +0000] "GET //localhost:31000/api/atlas/v2/types/classificationdef/name/blah HTTP/1.1" 404 81 "-" "Java/1.8.0_172"
127.0.0.1 - - [03/May/2018:19:21:29 +0000] "GET //localhost:31000/api/atlas/v2/types/classificationdef/guid/blah HTTP/1.1" 404 82 "-" "Java/1.8.0_172"
127.0.0.1 - - [03/May/2018:19:21:29 +0000] "GET //localhost:31000/api/atlas/v2/types/entitydef/name/blah HTTP/1.1" 404 81 "-" "Java/1.8.0_172"
127.0.0.1 - - [03/May/2018:19:21:29 +0000] "GET //localhost:31000/api/atlas/v2/types/entitydef/guid/blah HTTP/1.1" 404 82 "-" "Java/1.8.0_172"
127.0.0.1 - - [03/May/2018:19:21:29 +0000] "POST //localhost:31000/api/atlas/v2/types/typedefs/ HTTP/1.1" 200 1947 "-" "Java/1.8.0_172"
127.0.0.1 - - [03/May/2018:19:21:29 +0000] "GET //localhost:31000/api/atlas/v2/types/typedefs/?supertype=AVNen1DHzOx&type=CLASS HTTP/1.1" 200 1020 "-" "Java/1.8.0_172"
127.0.0.1 - - [03/May/2018:19:21:29 +0000] "GET //localhost:31000/api/atlas/v2/types/typedefs/?supertype=AVNen1DHzOx&type=CLASS&notsupertype=BVl5z1r156n HTTP/1.1" 200 550 "-" "Java/1.8.0_172"
127.0.0.1 - - [03/May/2018:19:21:29 +0000] "POST //localhost:31000/api/atlas/v2/types/typedefs/ HTTP/1.1" 200 532 "-" "Java/1.8.0_172"
127.0.0.1 - - [03/May/2018:19:21:29 +0000] "PUT //localhost:31000/api/atlas/v2/types/typedefs/ HTTP/1.1" 200 691 "-" "Java/1.8.0_172"
127.0.0.1 - - [03/May/2018:19:21:29 +0000] "GET //localhost:31000/api/atlas/v2/types/typedefs/?type=ENTITY HTTP/1.1" 200 68419 "-" "Java/1.8.0_172"
127.0.0.1 - - [03/May/2018:19:21:29 +0000] "GET //localhost:31000/api/atlas/v2/types/classificationdef/name/fetl HTTP/1.1" 200 451 "-" "Java/1.8.0_172"
127.0.0.1 - - [03/May/2018:19:21:29 +0000] "GET //localhost:31000/api/atlas/v2/types/entitydef/name/database HTTP/1.1" 200 755 "-" "Java/1.8.0_172"
127.0.0.1 - - [03/May/2018:19:21:29 +0000] "GET //localhost:31000/api/atlas/v2/types/entitydef/name/table HTTP/1.1" 200 1546 "-" "Java/1.8.0_172"
Tests run: 123, Failures: 4, Errors: 0, Skipped: 0, Time elapsed: 117.452 sec <<< FAILURE! - in TestSuite
testEnterValidValues(org.apache.atlas.CredentialProviderUtilityIT)  Time elapsed: 0.848 sec  <<< FAILURE!
java.io.IOException: Invalid secret key format
	at com.sun.crypto.provider.JceKeyStore.engineLoad(JceKeyStore.java:856)
	at java.security.KeyStore.load(KeyStore.java:1445)
	at org.apache.hadoop.security.alias.AbstractJavaKeyStoreProvider.<init>(AbstractJavaKeyStoreProvider.java:106)
	at org.apache.hadoop.security.alias.JavaKeyStoreProvider.<init>(JavaKeyStoreProvider.java:49)
	at org.apache.hadoop.security.alias.JavaKeyStoreProvider.<init>(JavaKeyStoreProvider.java:41)
	at org.apache.hadoop.security.alias.JavaKeyStoreProvider$Factory.createProvider(JavaKeyStoreProvider.java:100)
	at org.apache.hadoop.security.alias.CredentialProviderFactory.getProviders(CredentialProviderFactory.java:58)
	at org.apache.atlas.CredentialProviderUtilityIT.testEnterValidValues(CredentialProviderUtilityIT.java:76)

testEnterMismatchedValues(org.apache.atlas.CredentialProviderUtilityIT)  Time elapsed: 0.629 sec  <<< FAILURE!
java.io.IOException: Invalid secret key format
	at com.sun.crypto.provider.JceKeyStore.engineLoad(JceKeyStore.java:856)
	at java.security.KeyStore.load(KeyStore.java:1445)
	at org.apache.hadoop.security.alias.AbstractJavaKeyStoreProvider.<init>(AbstractJavaKeyStoreProvider.java:106)
	at org.apache.hadoop.security.alias.JavaKeyStoreProvider.<init>(JavaKeyStoreProvider.java:49)
	at org.apache.hadoop.security.alias.JavaKeyStoreProvider.<init>(JavaKeyStoreProvider.java:41)
	at org.apache.hadoop.security.alias.JavaKeyStoreProvider$Factory.createProvider(JavaKeyStoreProvider.java:100)
	at org.apache.hadoop.security.alias.CredentialProviderFactory.getProviders(CredentialProviderFactory.java:58)
	at org.apache.atlas.CredentialProviderUtilityIT.testEnterMismatchedValues(CredentialProviderUtilityIT.java:192)

testEnterEmptyValues(org.apache.atlas.CredentialProviderUtilityIT)  Time elapsed: 0.651 sec  <<< FAILURE!
java.io.IOException: Invalid secret key format
	at com.sun.crypto.provider.JceKeyStore.engineLoad(JceKeyStore.java:856)
	at java.security.KeyStore.load(KeyStore.java:1445)
	at org.apache.hadoop.security.alias.AbstractJavaKeyStoreProvider.<init>(AbstractJavaKeyStoreProvider.java:106)
	at org.apache.hadoop.security.alias.JavaKeyStoreProvider.<init>(JavaKeyStoreProvider.java:49)
	at org.apache.hadoop.security.alias.JavaKeyStoreProvider.<init>(JavaKeyStoreProvider.java:41)
	at org.apache.hadoop.security.alias.JavaKeyStoreProvider$Factory.createProvider(JavaKeyStoreProvider.java:100)
	at org.apache.hadoop.security.alias.CredentialProviderFactory.getProviders(CredentialProviderFactory.java:58)
	at org.apache.atlas.CredentialProviderUtilityIT.testEnterEmptyValues(CredentialProviderUtilityIT.java:138)

testOverwriteValues(org.apache.atlas.CredentialProviderUtilityIT)  Time elapsed: 0.66 sec  <<< FAILURE!
java.io.IOException: Invalid secret key format
	at com.sun.crypto.provider.JceKeyStore.engineLoad(JceKeyStore.java:856)
	at java.security.KeyStore.load(KeyStore.java:1445)
	at org.apache.hadoop.security.alias.AbstractJavaKeyStoreProvider.<init>(AbstractJavaKeyStoreProvider.java:106)
	at org.apache.hadoop.security.alias.JavaKeyStoreProvider.<init>(JavaKeyStoreProvider.java:49)
	at org.apache.hadoop.security.alias.JavaKeyStoreProvider.<init>(JavaKeyStoreProvider.java:41)
	at org.apache.hadoop.security.alias.JavaKeyStoreProvider$Factory.createProvider(JavaKeyStoreProvider.java:100)
	at org.apache.hadoop.security.alias.CredentialProviderFactory.getProviders(CredentialProviderFactory.java:58)
	at org.apache.atlas.util.CredentialProviderUtility.getCredentialProvider(CredentialProviderUtility.java:150)
	at org.apache.atlas.util.CredentialProviderUtility.main(CredentialProviderUtility.java:75)
	at org.apache.atlas.CredentialProviderUtilityIT.testOverwriteValues(CredentialProviderUtilityIT.java:251)


Results :

Failed tests: 
  CredentialProviderUtilityIT.testEnterEmptyValues:138 » IO Invalid secret key f...
  CredentialProviderUtilityIT.testEnterMismatchedValues:192 » IO Invalid secret ...
  CredentialProviderUtilityIT.testEnterValidValues:76 » IO Invalid secret key fo...
  CredentialProviderUtilityIT.testOverwriteValues:251 » IO Invalid secret key fo...

Tests run: 123, Failures: 4, Errors: 0, Skipped: 0

[INFO] 
[INFO] --- jetty-maven-plugin:9.3.14.v20161028:stop (stop-jetty) @ atlas-webapp ---
[INFO] Jetty not running!
[INFO] 
[INFO] --- maven-source-plugin:2.4:jar-no-fork (attach-sources) @ atlas-webapp ---
[INFO] Building jar: <https://builds.apache.org/job/PreCommit-ATLAS-Build-Test/ws/webapp/target/atlas-webapp-1.0.0-SNAPSHOT-sources.jar>
[INFO] 
[INFO] --- maven-source-plugin:2.4:test-jar-no-fork (attach-sources) @ atlas-webapp ---
[INFO] Building jar: <https://builds.apache.org/job/PreCommit-ATLAS-Build-Test/ws/webapp/target/atlas-webapp-1.0.0-SNAPSHOT-test-sources.jar>
[INFO] 
[INFO] --- maven-failsafe-plugin:2.18.1:verify (verify) @ atlas-webapp ---
[INFO] Failsafe report directory: <https://builds.apache.org/job/PreCommit-ATLAS-Build-Test/ws/webapp/target/failsafe-reports>
[INFO] ------------------------------------------------------------------------
[INFO] Reactor Summary:
[INFO] 
[INFO] Apache Atlas Server Build Tools .................... SUCCESS [  0.564 s]
[INFO] apache-atlas ....................................... SUCCESS [  3.449 s]
[INFO] Apache Atlas Test Utility Tools .................... SUCCESS [  4.693 s]
[INFO] Open Connector Framework (OCF) ..................... SUCCESS [  1.721 s]
[INFO] Open Metadata Repository Services (OMRS) ........... SUCCESS [  5.969 s]
[INFO] Open Metadata and Governance (OMAG) Server APIs .... SUCCESS [  1.816 s]
[INFO] Connected Asset Open Metadata Access Service (OMAS)  SUCCESS [  1.200 s]
[INFO] Asset Consumer Open Metadata Access Service (OMAS) . SUCCESS [  0.919 s]
[INFO] Open Metadata and Governance (OMAG) Server ......... SUCCESS [  0.964 s]
[INFO] Apache Atlas Integration ........................... SUCCESS [ 34.432 s]
[INFO] Apache Atlas Common ................................ SUCCESS [  3.070 s]
[INFO] Apache Atlas Client ................................ SUCCESS [  0.168 s]
[INFO] atlas-client-common ................................ SUCCESS [  0.791 s]
[INFO] atlas-client-v1 .................................... SUCCESS [  3.165 s]
[INFO] Apache Atlas Server API ............................ SUCCESS [  0.902 s]
[INFO] Apache Atlas Notification .......................... SUCCESS [ 15.126 s]
[INFO] atlas-client-v2 .................................... SUCCESS [  0.781 s]
[INFO] Apache Atlas Graph Database Projects ............... SUCCESS [  0.096 s]
[INFO] Apache Atlas Graph Database API .................... SUCCESS [  0.652 s]
[INFO] Graph Database Common Code ......................... SUCCESS [  0.910 s]
[INFO] Apache Atlas JanusGraph DB Impl .................... SUCCESS [02:08 min]
[INFO] Apache Atlas Graph Database Implementation Dependencies SUCCESS [  3.288 s]
[INFO] Shaded version of Apache hbase client .............. SUCCESS [ 13.026 s]
[INFO] Shaded version of Apache hbase server .............. SUCCESS [ 31.904 s]
[INFO] Apache Atlas Authorization ......................... SUCCESS [  2.497 s]
[INFO] Apache Atlas Repository ............................ SUCCESS [02:24 min]
[INFO] Apache Atlas UI .................................... SUCCESS [01:27 min]
[INFO] Apache Atlas Web Application ....................... FAILURE [07:30 min]
[INFO] Apache Atlas Documentation ......................... SKIPPED
[INFO] Apache Atlas FileSystem Model ...................... SKIPPED
[INFO] Apache Atlas Plugin Classloader .................... SKIPPED
[INFO] Apache Atlas Hive Bridge Shim ...................... SKIPPED
[INFO] Apache Atlas Hive Bridge ........................... SKIPPED
[INFO] Apache Atlas Falcon Bridge Shim .................... SKIPPED
[INFO] Apache Atlas Falcon Bridge ......................... SKIPPED
[INFO] Apache Atlas Sqoop Bridge Shim ..................... SKIPPED
[INFO] Apache Atlas Sqoop Bridge .......................... SKIPPED
[INFO] Apache Atlas Storm Bridge Shim ..................... SKIPPED
[INFO] Apache Atlas Storm Bridge .......................... SKIPPED
[INFO] Apache Atlas Hbase Bridge Shim ..................... SKIPPED
[INFO] Apache Atlas Hbase Bridge .......................... SKIPPED
[INFO] Apache Atlas Kafka Bridge .......................... SKIPPED
[INFO] Apache Atlas Migration Exporter .................... SKIPPED
[INFO] Apache Atlas Distribution .......................... SKIPPED
[INFO] ------------------------------------------------------------------------
[INFO] BUILD FAILURE
[INFO] ------------------------------------------------------------------------
[INFO] Total time: 15:44 min
[INFO] Finished at: 2018-05-03T19:21:30Z
[INFO] Final Memory: 380M/2529M
[INFO] ------------------------------------------------------------------------
[ERROR] Failed to execute goal org.apache.maven.plugins:maven-failsafe-plugin:2.18.1:verify (verify) on project atlas-webapp: There are test failures.
[ERROR] 
[ERROR] Please refer to <https://builds.apache.org/job/PreCommit-ATLAS-Build-Test/ws/webapp/target/failsafe-reports> for the individual test results.
[ERROR] -> [Help 1]
[ERROR] 
[ERROR] To see the full stack trace of the errors, re-run Maven with the -e switch.
[ERROR] Re-run Maven using the -X switch to enable full debug logging.
[ERROR] 
[ERROR] For more information about the errors and possible solutions, please read the following articles:
[ERROR] [Help 1] http://cwiki.apache.org/confluence/display/MAVEN/MojoFailureException
[ERROR] 
[ERROR] After correcting the problems, you can resume the build with the command
[ERROR]   mvn <goals> -rf :atlas-webapp
[INFO] Stopped ServerConnector@6dd8c564{HTTP/1.1,[http/1.1]}{0.0.0.0:0}
[INFO] Stopped o.e.j.s.ServletContextHandler@7da15c8b{/solr,null,UNAVAILABLE}




{color:red}-1 overall{color}.  

    {color:red}-1 @author{color}.  The patch appears to contain 7 @author tags which the Atlas community has agreed to not allow in code contributions.

Console output: https://builds.apache.org/job/PreCommit-ATLAS-Build-Test/342//console

This message is automatically generated.


======================================================================
======================================================================
    Adding comment to Jira.
======================================================================
======================================================================




======================================================================
======================================================================
    Finished build.
======================================================================
======================================================================


+ EXIT_CODE=1
+ '[' -d <https://builds.apache.org/job/PreCommit-ATLAS-Build-Test/ws/../atlas_patchprocess_1386> ']'
+ '[' -d <https://builds.apache.org/job/PreCommit-ATLAS-Build-Test/ws/atlas_patchprocess_1386> ']'
+ mv <https://builds.apache.org/job/PreCommit-ATLAS-Build-Test/ws/atlas_patchprocess_1386> <https://builds.apache.org/job/PreCommit-ATLAS-Build-Test/ws/patchprocess>
+ rm -f <https://builds.apache.org/job/PreCommit-ATLAS-Build-Test/ws/../atlas_patchprocess_1386>
+ exit 1
Build step 'Execute shell' marked build as failure
Set build name.
New build name is '#342-master-ATLAS-2521.1.patch'
Archiving artifacts
[Fast Archiver] Compressed 164.69 MB of artifacts by 84.6% relative to #340