git.net

[Date Prev][Date Next][Thread Prev][Thread Next][Date Index][Thread Index]

Build failed in Jenkins: PreCommit-ATLAS-Build-Test #339-master-


See <https://builds.apache.org/job/PreCommit-ATLAS-Build-Test/339/display/redirect>

------------------------------------------
[...truncated 483.01 KB...]
127.0.0.1 - - [03/May/2018:14:50:39 +0000] "DELETE //localhost:31000/api/atlas/v2/entity/guid/random/classification/blah_trait HTTP/1.1" 400 105 "-" "Java/1.8.0_172"
127.0.0.1 - - [03/May/2018:14:50:39 +0000] "GET //localhost:31000/api/atlas/discovery/search/dsl?query=hive_db_v2+where+name%3D'dbYBXZ5N0Lkf'&limit=10&offset=0 HTTP/1.1" 200 1658 "-" "Java/1.8.0_172"
127.0.0.1 - - [03/May/2018:14:50:39 +0000] "GET //localhost:31000/api/atlas/discovery/search/dsl?query=hive_db_v2+where+name%3D'dbYBXZ5N0Lkf'&limit=10&offset=0 HTTP/1.1" 200 1658 "-" "Java/1.8.0_172"
127.0.0.1 - - [03/May/2018:14:50:40 +0000] "POST //localhost:31000/api/atlas/v2/entity/ HTTP/1.1" 200 387 "-" "Java/1.8.0_172"
127.0.0.1 - - [03/May/2018:14:50:40 +0000] "GET //localhost:31000/api/atlas/discovery/search/dsl?query=hive_db_v2+where+name%3D'dbYBXZ5N0Lkf'&limit=10&offset=0 HTTP/1.1" 200 2726 "-" "Java/1.8.0_172"
127.0.0.1 - - [03/May/2018:14:50:41 +0000] "POST //localhost:31000/api/atlas/v2/types/typedefs/ HTTP/1.1" 200 532 "-" "Java/1.8.0_172"
127.0.0.1 - - [03/May/2018:14:50:41 +0000] "POST //localhost:31000/api/atlas/v2/entity/ HTTP/1.1" 200 237 "-" "Java/1.8.0_172"
127.0.0.1 - - [03/May/2018:14:50:41 +0000] "PUT //localhost:31000/api/atlas/v2/types/typedefs/ HTTP/1.1" 200 691 "-" "Java/1.8.0_172"
127.0.0.1 - - [03/May/2018:14:50:41 +0000] "GET //localhost:31000/api/atlas/v2/entity/guid/c21021f7-fed1-4419-9b71-e22b0650890f HTTP/1.1" 200 282 "-" "Java/1.8.0_172"
127.0.0.1 - - [03/May/2018:14:50:41 +0000] "POST //localhost:31000/api/atlas/v2/entity/ HTTP/1.1" 404 181 "-" "Java/1.8.0_172"
127.0.0.1 - - [03/May/2018:14:50:41 +0000] "POST //localhost:31000/api/atlas/v2/entity/ HTTP/1.1" 200 237 "-" "Java/1.8.0_172"
127.0.0.1 - - [03/May/2018:14:50:41 +0000] "POST //localhost:31000/api/atlas/v2/entity/ HTTP/1.1" 200 178 "-" "Java/1.8.0_172"
127.0.0.1 - - [03/May/2018:14:50:41 +0000] "GET //localhost:31000/api/atlas/v2/entity/uniqueAttribute/type/hive_db_v2?attr:name=dbYBXZ5N0Lkf HTTP/1.1" 200 3537 "-" "Java/1.8.0_172"
127.0.0.1 - - [03/May/2018:14:50:41 +0000] "GET //localhost:31000/api/atlas/v2/entity/guid/blah HTTP/1.1" 404 95 "-" "Java/1.8.0_172"
127.0.0.1 - - [03/May/2018:14:50:41 +0000] "POST //localhost:31000/api/atlas/v2/entity/ HTTP/1.1" 200 237 "-" "Java/1.8.0_172"
127.0.0.1 - - [03/May/2018:14:50:41 +0000] "GET //localhost:31000/api/atlas/entities/231e98bd-0e5e-4041-a033-a557ee395c5d/audit?count=10 HTTP/1.1" 200 952 "-" "Java/1.8.0_172"
127.0.0.1 - - [03/May/2018:14:50:41 +0000] "POST //localhost:31000/api/atlas/v2/entity/ HTTP/1.1" 200 239 "-" "Java/1.8.0_172"
127.0.0.1 - - [03/May/2018:14:50:41 +0000] "POST //localhost:31000/api/atlas/v2/entity/ HTTP/1.1" 200 392 "-" "Java/1.8.0_172"
127.0.0.1 - - [03/May/2018:14:50:42 +0000] "GET //localhost:31000/api/atlas/v2/types/typedef/name/D5sxkpibQD HTTP/1.1" 404 87 "-" "Java/1.8.0_172"
127.0.0.1 - - [03/May/2018:14:50:42 +0000] "POST //localhost:31000/api/atlas/v2/types/typedefs/ HTTP/1.1" 200 558 "-" "Java/1.8.0_172"
127.0.0.1 - - [03/May/2018:14:50:42 +0000] "POST //localhost:31000/api/atlas/v2/entity/ HTTP/1.1" 200 283 "-" "Java/1.8.0_172"
127.0.0.1 - - [03/May/2018:14:50:42 +0000] "GET //localhost:31000/api/atlas/v2/entity/guid/28a7b528-61c7-4772-a8b0-652c28df2f8b HTTP/1.1" 200 309 "-" "Java/1.8.0_172"
127.0.0.1 - - [03/May/2018:14:50:42 +0000] "GET //localhost:31000/api/atlas/types/database HTTP/1.1" 200 748 "-" "Java/1.8.0_172"
127.0.0.1 - - [03/May/2018:14:50:42 +0000] "GET //localhost:31000/api/atlas/types/table HTTP/1.1" 200 1725 "-" "Java/1.8.0_172"
127.0.0.1 - - [03/May/2018:14:50:42 +0000] "GET //localhost:31000/api/atlas/types/fetl HTTP/1.1" 200 539 "-" "Java/1.8.0_172"
127.0.0.1 - - [03/May/2018:14:50:42 +0000] "GET //localhost:31000/api/atlas/types HTTP/1.1" 200 2408 "-" "Java/1.8.0_172"
127.0.0.1 - - [03/May/2018:14:50:42 +0000] "GET //localhost:31000/api/atlas/v2/entity/guid/ec1a7cf2-1829-49c0-91bd-25f04eeaba19 HTTP/1.1" 200 1506 "-" "Java/1.8.0_172"
127.0.0.1 - - [03/May/2018:14:50:42 +0000] "POST //localhost:31000/api/atlas/v2/entity/ HTTP/1.1" 200 195 "-" "Java/1.8.0_172"
127.0.0.1 - - [03/May/2018:14:50:42 +0000] "GET //localhost:31000/api/atlas/v2/entity/guid/ec1a7cf2-1829-49c0-91bd-25f04eeaba19 HTTP/1.1" 200 1524 "-" "Java/1.8.0_172"
127.0.0.1 - - [03/May/2018:14:50:42 +0000] "GET //localhost:31000/api/atlas/v2/entity/guid/ec1a7cf2-1829-49c0-91bd-25f04eeaba19 HTTP/1.1" 200 1524 "-" "Java/1.8.0_172"
127.0.0.1 - - [03/May/2018:14:50:42 +0000] "POST //localhost:31000/api/atlas/v2/entity/ HTTP/1.1" 200 195 "-" "Java/1.8.0_172"
127.0.0.1 - - [03/May/2018:14:50:42 +0000] "GET //localhost:31000/api/atlas/v2/entity/guid/ec1a7cf2-1829-49c0-91bd-25f04eeaba19 HTTP/1.1" 200 1536 "-" "Java/1.8.0_172"
127.0.0.1 - - [03/May/2018:14:50:43 +0000] "GET //localhost:31000/api/atlas/v2/entity/guid/ec1a7cf2-1829-49c0-91bd-25f04eeaba19 HTTP/1.1" 200 1536 "-" "Java/1.8.0_172"
127.0.0.1 - - [03/May/2018:14:50:43 +0000] "POST //localhost:31000/api/atlas/v2/entity/ HTTP/1.1" 200 513 "-" "Java/1.8.0_172"
127.0.0.1 - - [03/May/2018:14:50:43 +0000] "GET //localhost:31000/api/atlas/v2/entity/guid/ec1a7cf2-1829-49c0-91bd-25f04eeaba19 HTTP/1.1" 200 1674 "-" "Java/1.8.0_172"
127.0.0.1 - - [03/May/2018:14:50:43 +0000] "GET //localhost:31000/api/atlas/v2/types/typedef/name/PII_TraitmHGpFQAbFr HTTP/1.1" 404 96 "-" "Java/1.8.0_172"
127.0.0.1 - - [03/May/2018:14:50:43 +0000] "POST //localhost:31000/api/atlas/v2/types/typedefs/ HTTP/1.1" 200 576 "-" "Java/1.8.0_172"
127.0.0.1 - - [03/May/2018:14:50:43 +0000] "DELETE //localhost:31000/api/atlas/v2/entity/guid/ec1a7cf2-1829-49c0-91bd-25f04eeaba19/classification/PII_TraitmHGpFQAbFr HTTP/1.1" 400 114 "-" "Java/1.8.0_172"
127.0.0.1 - - [03/May/2018:14:50:43 +0000] "GET //localhost:31000/api/atlas/v2/types/typedef/name/PII_TraitEhX1Ts0Qyq HTTP/1.1" 404 96 "-" "Java/1.8.0_172"
127.0.0.1 - - [03/May/2018:14:50:43 +0000] "POST //localhost:31000/api/atlas/v2/types/typedefs/ HTTP/1.1" 200 425 "-" "Java/1.8.0_172"
127.0.0.1 - - [03/May/2018:14:50:43 +0000] "GET //localhost:31000/api/atlas/v2/types/classificationdef/name/PII_TraitEhX1Ts0Qyq HTTP/1.1" 200 332 "-" "Java/1.8.0_172"
127.0.0.1 - - [03/May/2018:14:50:43 +0000] "POST //localhost:31000/api/atlas/v2/entity/guid/ec1a7cf2-1829-49c0-91bd-25f04eeaba19/classifications HTTP/1.1" 204 0 "-" "Java/1.8.0_172"
127.0.0.1 - - [03/May/2018:14:50:43 +0000] "GET //localhost:31000/api/atlas/v2/entity/guid/ec1a7cf2-1829-49c0-91bd-25f04eeaba19/classifications HTTP/1.1" 200 868 "-" "Java/1.8.0_172"
127.0.0.1 - - [03/May/2018:14:50:43 +0000] "GET //localhost:31000/api/atlas/v2/entity/guid/ec1a7cf2-1829-49c0-91bd-25f04eeaba19/classifications HTTP/1.1" 200 868 "-" "Java/1.8.0_172"
127.0.0.1 - - [03/May/2018:14:50:43 +0000] "POST //localhost:31000/api/atlas/v2/entity/ HTTP/1.1" 200 359 "-" "Java/1.8.0_172"
127.0.0.1 - - [03/May/2018:14:50:44 +0000] "GET //localhost:31000/api/atlas/v2/entity/guid/ec1a7cf2-1829-49c0-91bd-25f04eeaba19 HTTP/1.1" 200 1854 "-" "Java/1.8.0_172"
127.0.0.1 - - [03/May/2018:14:50:44 +0000] "PUT //localhost:31000/api/atlas/v2/entity/uniqueAttribute/type/hive_table_v2?attr:qualifiedName=tablezM6yi09YQy HTTP/1.1" 200 510 "-" "Java/1.8.0_172"
127.0.0.1 - - [03/May/2018:14:50:44 +0000] "GET //localhost:31000/api/atlas/v2/entity/guid/ec1a7cf2-1829-49c0-91bd-25f04eeaba19 HTTP/1.1" 200 1930 "-" "Java/1.8.0_172"
127.0.0.1 - - [03/May/2018:14:51:03 +0000] "GET //localhost:31000/api/atlas/v2/types/typedef/name/PII_TraithbpmA9kgEB HTTP/1.1" 404 96 "-" "Java/1.8.0_172"
127.0.0.1 - - [03/May/2018:14:51:03 +0000] "POST //localhost:31000/api/atlas/v2/types/typedefs/ HTTP/1.1" 200 425 "-" "Java/1.8.0_172"
127.0.0.1 - - [03/May/2018:14:51:03 +0000] "POST //localhost:31000/api/atlas/v2/entity/guid/ec1a7cf2-1829-49c0-91bd-25f04eeaba19/classifications HTTP/1.1" 204 0 "-" "Java/1.8.0_172"
127.0.0.1 - - [03/May/2018:14:51:03 +0000] "GET //localhost:31000/api/atlas/entities/ec1a7cf2-1829-49c0-91bd-25f04eeaba19/audit?count=100 HTTP/1.1" 200 21391 "-" "Java/1.8.0_172"
127.0.0.1 - - [03/May/2018:14:51:03 +0000] "GET //localhost:31000/api/atlas/v2/types/typedef/name/PII_Traitzdf2qmnCyp HTTP/1.1" 404 96 "-" "Java/1.8.0_172"
127.0.0.1 - - [03/May/2018:14:51:03 +0000] "POST //localhost:31000/api/atlas/v2/types/typedefs/ HTTP/1.1" 200 576 "-" "Java/1.8.0_172"
127.0.0.1 - - [03/May/2018:14:51:04 +0000] "POST //localhost:31000/api/atlas/v2/entity/guid/ec1a7cf2-1829-49c0-91bd-25f04eeaba19/classifications HTTP/1.1" 204 0 "-" "Java/1.8.0_172"
127.0.0.1 - - [03/May/2018:14:51:04 +0000] "GET //localhost:31000/api/atlas/v2/entity/guid/ec1a7cf2-1829-49c0-91bd-25f04eeaba19 HTTP/1.1" 200 2166 "-" "Java/1.8.0_172"
127.0.0.1 - - [03/May/2018:14:51:04 +0000] "GET //localhost:31000/api/atlas/v2/types/typedef/name/PII_TraitY38aY3miVf HTTP/1.1" 404 96 "-" "Java/1.8.0_172"
127.0.0.1 - - [03/May/2018:14:51:04 +0000] "POST //localhost:31000/api/atlas/v2/types/typedefs/ HTTP/1.1" 200 425 "-" "Java/1.8.0_172"
127.0.0.1 - - [03/May/2018:14:51:04 +0000] "POST //localhost:31000/api/atlas/v2/entity/guid/ec1a7cf2-1829-49c0-91bd-25f04eeaba19/classifications HTTP/1.1" 204 0 "-" "Java/1.8.0_172"
127.0.0.1 - - [03/May/2018:14:51:05 +0000] "GET //localhost:31000/api/atlas/entities/ec1a7cf2-1829-49c0-91bd-25f04eeaba19/audit?count=100 HTTP/1.1" 200 22089 "-" "Java/1.8.0_172"
127.0.0.1 - - [03/May/2018:14:51:05 +0000] "GET //localhost:31000/api/atlas/v2/entity/guid/ec1a7cf2-1829-49c0-91bd-25f04eeaba19/classifications HTTP/1.1" 200 1315 "-" "Java/1.8.0_172"
127.0.0.1 - - [03/May/2018:14:51:05 +0000] "DELETE //localhost:31000/api/atlas/v2/entity/guid/ec1a7cf2-1829-49c0-91bd-25f04eeaba19/classification/PII_TraitY38aY3miVf HTTP/1.1" 204 0 "-" "Java/1.8.0_172"
127.0.0.1 - - [03/May/2018:14:51:05 +0000] "GET //localhost:31000/api/atlas/entities/ec1a7cf2-1829-49c0-91bd-25f04eeaba19/audit?count=100 HTTP/1.1" 200 22320 "-" "Java/1.8.0_172"
Tests run: 123, Failures: 4, Errors: 0, Skipped: 0, Time elapsed: 153.251 sec <<< FAILURE! - in TestSuite
testEnterEmptyValues(org.apache.atlas.CredentialProviderUtilityIT)  Time elapsed: 0.92 sec  <<< FAILURE!
java.io.IOException: Invalid secret key format
	at com.sun.crypto.provider.JceKeyStore.engineLoad(JceKeyStore.java:856)
	at java.security.KeyStore.load(KeyStore.java:1445)
	at org.apache.hadoop.security.alias.AbstractJavaKeyStoreProvider.<init>(AbstractJavaKeyStoreProvider.java:106)
	at org.apache.hadoop.security.alias.JavaKeyStoreProvider.<init>(JavaKeyStoreProvider.java:49)
	at org.apache.hadoop.security.alias.JavaKeyStoreProvider.<init>(JavaKeyStoreProvider.java:41)
	at org.apache.hadoop.security.alias.JavaKeyStoreProvider$Factory.createProvider(JavaKeyStoreProvider.java:100)
	at org.apache.hadoop.security.alias.CredentialProviderFactory.getProviders(CredentialProviderFactory.java:58)
	at org.apache.atlas.CredentialProviderUtilityIT.testEnterEmptyValues(CredentialProviderUtilityIT.java:138)

testEnterMismatchedValues(org.apache.atlas.CredentialProviderUtilityIT)  Time elapsed: 0.569 sec  <<< FAILURE!
java.io.IOException: Invalid secret key format
	at com.sun.crypto.provider.JceKeyStore.engineLoad(JceKeyStore.java:856)
	at java.security.KeyStore.load(KeyStore.java:1445)
	at org.apache.hadoop.security.alias.AbstractJavaKeyStoreProvider.<init>(AbstractJavaKeyStoreProvider.java:106)
	at org.apache.hadoop.security.alias.JavaKeyStoreProvider.<init>(JavaKeyStoreProvider.java:49)
	at org.apache.hadoop.security.alias.JavaKeyStoreProvider.<init>(JavaKeyStoreProvider.java:41)
	at org.apache.hadoop.security.alias.JavaKeyStoreProvider$Factory.createProvider(JavaKeyStoreProvider.java:100)
	at org.apache.hadoop.security.alias.CredentialProviderFactory.getProviders(CredentialProviderFactory.java:58)
	at org.apache.atlas.CredentialProviderUtilityIT.testEnterMismatchedValues(CredentialProviderUtilityIT.java:192)

testEnterValidValues(org.apache.atlas.CredentialProviderUtilityIT)  Time elapsed: 0.578 sec  <<< FAILURE!
java.io.IOException: Invalid secret key format
	at com.sun.crypto.provider.JceKeyStore.engineLoad(JceKeyStore.java:856)
	at java.security.KeyStore.load(KeyStore.java:1445)
	at org.apache.hadoop.security.alias.AbstractJavaKeyStoreProvider.<init>(AbstractJavaKeyStoreProvider.java:106)
	at org.apache.hadoop.security.alias.JavaKeyStoreProvider.<init>(JavaKeyStoreProvider.java:49)
	at org.apache.hadoop.security.alias.JavaKeyStoreProvider.<init>(JavaKeyStoreProvider.java:41)
	at org.apache.hadoop.security.alias.JavaKeyStoreProvider$Factory.createProvider(JavaKeyStoreProvider.java:100)
	at org.apache.hadoop.security.alias.CredentialProviderFactory.getProviders(CredentialProviderFactory.java:58)
	at org.apache.atlas.CredentialProviderUtilityIT.testEnterValidValues(CredentialProviderUtilityIT.java:76)

testOverwriteValues(org.apache.atlas.CredentialProviderUtilityIT)  Time elapsed: 0.579 sec  <<< FAILURE!
java.io.IOException: Invalid secret key format
	at com.sun.crypto.provider.JceKeyStore.engineLoad(JceKeyStore.java:856)
	at java.security.KeyStore.load(KeyStore.java:1445)
	at org.apache.hadoop.security.alias.AbstractJavaKeyStoreProvider.<init>(AbstractJavaKeyStoreProvider.java:106)
	at org.apache.hadoop.security.alias.JavaKeyStoreProvider.<init>(JavaKeyStoreProvider.java:49)
	at org.apache.hadoop.security.alias.JavaKeyStoreProvider.<init>(JavaKeyStoreProvider.java:41)
	at org.apache.hadoop.security.alias.JavaKeyStoreProvider$Factory.createProvider(JavaKeyStoreProvider.java:100)
	at org.apache.hadoop.security.alias.CredentialProviderFactory.getProviders(CredentialProviderFactory.java:58)
	at org.apache.atlas.util.CredentialProviderUtility.getCredentialProvider(CredentialProviderUtility.java:150)
	at org.apache.atlas.util.CredentialProviderUtility.main(CredentialProviderUtility.java:75)
	at org.apache.atlas.CredentialProviderUtilityIT.testOverwriteValues(CredentialProviderUtilityIT.java:251)


Results :

Failed tests: 
  CredentialProviderUtilityIT.testEnterEmptyValues:138 » IO Invalid secret key f...
  CredentialProviderUtilityIT.testEnterMismatchedValues:192 » IO Invalid secret ...
  CredentialProviderUtilityIT.testEnterValidValues:76 » IO Invalid secret key fo...
  CredentialProviderUtilityIT.testOverwriteValues:251 » IO Invalid secret key fo...

Tests run: 123, Failures: 4, Errors: 0, Skipped: 0

[INFO] 
[INFO] --- jetty-maven-plugin:9.3.14.v20161028:stop (stop-jetty) @ atlas-webapp ---
[INFO] Waiting 10 seconds for jetty to stop
[INFO] Stopped ServerConnector@7ccbe38d{HTTP/1.1,[http/1.1]}{0.0.0.0:31000}
[INFO] Closing Spring root WebApplicationContext
[INFO] Shutting down log4j
[INFO] Stopped o.e.j.m.p.JettyWebAppContext@36c5dada{/,file://<https://builds.apache.org/job/PreCommit-ATLAS-Build-Test/ws/webapp/target/atlas-webapp-1.0.0-SNAPSHOT/,UNAVAILABLE}{/home/jenkins/jenkins-slave/workspace/PreCommit-ATLAS-Build-Test/webapp/target/atlas-webapp-1.0.0-SNAPSHOT.war}>
[INFO] Server reports itself as stopped
[INFO] 
[INFO] --- maven-source-plugin:2.4:jar-no-fork (attach-sources) @ atlas-webapp ---
[INFO] Building jar: <https://builds.apache.org/job/PreCommit-ATLAS-Build-Test/ws/webapp/target/atlas-webapp-1.0.0-SNAPSHOT-sources.jar>
log4j:WARN No appenders could be found for logger (org.apache.zookeeper.ClientCnxn).
log4j:WARN Please initialize the log4j system properly.
log4j:WARN See http://logging.apache.org/log4j/1.2/faq.html#noconfig for more info.
[INFO] 
[INFO] --- maven-source-plugin:2.4:test-jar-no-fork (attach-sources) @ atlas-webapp ---
[INFO] Building jar: <https://builds.apache.org/job/PreCommit-ATLAS-Build-Test/ws/webapp/target/atlas-webapp-1.0.0-SNAPSHOT-test-sources.jar>
[INFO] 
[INFO] --- maven-failsafe-plugin:2.18.1:verify (verify) @ atlas-webapp ---
[INFO] Failsafe report directory: <https://builds.apache.org/job/PreCommit-ATLAS-Build-Test/ws/webapp/target/failsafe-reports>
[INFO] ------------------------------------------------------------------------
[INFO] Reactor Summary:
[INFO] 
[INFO] Apache Atlas Server Build Tools .................... SUCCESS [  0.672 s]
[INFO] apache-atlas ....................................... SUCCESS [  3.345 s]
[INFO] Apache Atlas Test Utility Tools .................... SUCCESS [  4.562 s]
[INFO] Open Connector Framework (OCF) ..................... SUCCESS [  1.861 s]
[INFO] Open Metadata Repository Services (OMRS) ........... SUCCESS [  6.295 s]
[INFO] Open Metadata and Governance (OMAG) Server APIs .... SUCCESS [  1.146 s]
[INFO] Connected Asset Open Metadata Access Service (OMAS)  SUCCESS [  1.379 s]
[INFO] Asset Consumer Open Metadata Access Service (OMAS) . SUCCESS [  1.084 s]
[INFO] Open Metadata and Governance (OMAG) Server ......... SUCCESS [  0.811 s]
[INFO] Apache Atlas Integration ........................... SUCCESS [ 38.871 s]
[INFO] Apache Atlas Common ................................ SUCCESS [  2.325 s]
[INFO] Apache Atlas Client ................................ SUCCESS [  0.113 s]
[INFO] atlas-client-common ................................ SUCCESS [  0.739 s]
[INFO] atlas-client-v1 .................................... SUCCESS [  2.676 s]
[INFO] Apache Atlas Server API ............................ SUCCESS [  0.839 s]
[INFO] Apache Atlas Notification .......................... SUCCESS [ 16.924 s]
[INFO] atlas-client-v2 .................................... SUCCESS [  0.690 s]
[INFO] Apache Atlas Graph Database Projects ............... SUCCESS [  0.082 s]
[INFO] Apache Atlas Graph Database API .................... SUCCESS [  0.712 s]
[INFO] Graph Database Common Code ......................... SUCCESS [  0.747 s]
[INFO] Apache Atlas JanusGraph DB Impl .................... SUCCESS [02:15 min]
[INFO] Apache Atlas Graph Database Implementation Dependencies SUCCESS [  1.836 s]
[INFO] Shaded version of Apache hbase client .............. SUCCESS [  7.371 s]
[INFO] Apache Atlas Titan 0.5.4 Graph DB Impl ............. SUCCESS [ 28.046 s]
[INFO] Shaded version of Apache hbase server .............. SUCCESS [ 20.153 s]
[INFO] Apache Atlas Authorization ......................... SUCCESS [  2.269 s]
[INFO] Apache Atlas Repository ............................ SUCCESS [02:59 min]
[INFO] Apache Atlas UI .................................... SUCCESS [01:48 min]
[INFO] Apache Atlas Web Application ....................... FAILURE [08:52 min]
[INFO] Apache Atlas Documentation ......................... SKIPPED
[INFO] Apache Atlas FileSystem Model ...................... SKIPPED
[INFO] Apache Atlas Plugin Classloader .................... SKIPPED
[INFO] Apache Atlas Hive Bridge Shim ...................... SKIPPED
[INFO] Apache Atlas Hive Bridge ........................... SKIPPED
[INFO] Apache Atlas Falcon Bridge Shim .................... SKIPPED
[INFO] Apache Atlas Falcon Bridge ......................... SKIPPED
[INFO] Apache Atlas Sqoop Bridge Shim ..................... SKIPPED
[INFO] Apache Atlas Sqoop Bridge .......................... SKIPPED
[INFO] Apache Atlas Storm Bridge Shim ..................... SKIPPED
[INFO] Apache Atlas Storm Bridge .......................... SKIPPED
[INFO] Apache Atlas Hbase Bridge Shim ..................... SKIPPED
[INFO] Apache Atlas Hbase Bridge .......................... SKIPPED
[INFO] Apache Atlas Kafka Bridge .......................... SKIPPED
[INFO] Apache Atlas Migration Exporter .................... SKIPPED
[INFO] Apache Atlas Distribution .......................... SKIPPED
[INFO] ------------------------------------------------------------------------
[INFO] BUILD FAILURE
[INFO] ------------------------------------------------------------------------
[INFO] Total time: 18:22 min
[INFO] Finished at: 2018-05-03T14:51:09Z
[INFO] Final Memory: 388M/2165M
[INFO] ------------------------------------------------------------------------
[ERROR] Failed to execute goal org.apache.maven.plugins:maven-failsafe-plugin:2.18.1:verify (verify) on project atlas-webapp: There are test failures.
[ERROR] 
[ERROR] Please refer to <https://builds.apache.org/job/PreCommit-ATLAS-Build-Test/ws/webapp/target/failsafe-reports> for the individual test results.
[ERROR] -> [Help 1]
[ERROR] 
[ERROR] To see the full stack trace of the errors, re-run Maven with the -e switch.
[ERROR] Re-run Maven using the -X switch to enable full debug logging.
[ERROR] 
[ERROR] For more information about the errors and possible solutions, please read the following articles:
[ERROR] [Help 1] http://cwiki.apache.org/confluence/display/MAVEN/MojoFailureException
[ERROR] 
[ERROR] After correcting the problems, you can resume the build with the command
[ERROR]   mvn <goals> -rf :atlas-webapp




{color:red}-1 overall{color}.  

    {color:green}+1 @author{color}.  The patch does not contain any @author tags.

Console output: https://builds.apache.org/job/PreCommit-ATLAS-Build-Test/339//console

This message is automatically generated.


======================================================================
======================================================================
    Adding comment to Jira.
======================================================================
======================================================================




======================================================================
======================================================================
    Finished build.
======================================================================
======================================================================


+ EXIT_CODE=1
+ '[' -d <https://builds.apache.org/job/PreCommit-ATLAS-Build-Test/ws/../atlas_patchprocess_19221> ']'
+ '[' -d <https://builds.apache.org/job/PreCommit-ATLAS-Build-Test/ws/atlas_patchprocess_19221> ']'
+ mv <https://builds.apache.org/job/PreCommit-ATLAS-Build-Test/ws/atlas_patchprocess_19221> <https://builds.apache.org/job/PreCommit-ATLAS-Build-Test/ws/patchprocess>
+ rm -f <https://builds.apache.org/job/PreCommit-ATLAS-Build-Test/ws/../atlas_patchprocess_19221>
+ exit 1
Build step 'Execute shell' marked build as failure
Set build name.
New build name is '#339-master-'
Archiving artifacts
[Fast Archiver] Compressed 164.77 MB of artifacts by 84.5% relative to #331