git.net

[Date Prev][Date Next][Thread Prev][Thread Next][Date Index][Thread Index]

Build failed in Jenkins: Atlas-master-IntegrationTests #1228


See <https://builds.apache.org/job/Atlas-master-IntegrationTests/1228/display/redirect>

------------------------------------------
[...truncated 567.82 KB...]
127.0.0.1 - - [03/May/2018:09:45:50 +0000] "GET //localhost:31000/api/atlas/v2/entity/guid/1d754bb9-85c7-450b-b830-b770fa2911cb HTTP/1.1" 200 1524 "-" "Java/1.8.0_172"
127.0.0.1 - - [03/May/2018:09:45:50 +0000] "POST //localhost:31000/api/atlas/v2/entity/ HTTP/1.1" 200 195 "-" "Java/1.8.0_172"
127.0.0.1 - - [03/May/2018:09:45:51 +0000] "GET //localhost:31000/api/atlas/v2/entity/guid/1d754bb9-85c7-450b-b830-b770fa2911cb HTTP/1.1" 200 1536 "-" "Java/1.8.0_172"
127.0.0.1 - - [03/May/2018:09:45:51 +0000] "GET //localhost:31000/api/atlas/v2/entity/guid/1d754bb9-85c7-450b-b830-b770fa2911cb HTTP/1.1" 200 1536 "-" "Java/1.8.0_172"
127.0.0.1 - - [03/May/2018:09:45:51 +0000] "POST //localhost:31000/api/atlas/v2/entity/ HTTP/1.1" 200 513 "-" "Java/1.8.0_172"
127.0.0.1 - - [03/May/2018:09:45:51 +0000] "GET //localhost:31000/api/atlas/v2/entity/guid/1d754bb9-85c7-450b-b830-b770fa2911cb HTTP/1.1" 200 1674 "-" "Java/1.8.0_172"
127.0.0.1 - - [03/May/2018:09:45:51 +0000] "GET //localhost:31000/api/atlas/v2/types/typedef/name/PII_TraitOf6R8T9sRU HTTP/1.1" 404 96 "-" "Java/1.8.0_172"
127.0.0.1 - - [03/May/2018:09:45:51 +0000] "POST //localhost:31000/api/atlas/v2/types/typedefs/ HTTP/1.1" 200 576 "-" "Java/1.8.0_172"
127.0.0.1 - - [03/May/2018:09:45:51 +0000] "DELETE //localhost:31000/api/atlas/v2/entity/guid/1d754bb9-85c7-450b-b830-b770fa2911cb/classification/PII_TraitOf6R8T9sRU HTTP/1.1" 400 114 "-" "Java/1.8.0_172"
127.0.0.1 - - [03/May/2018:09:45:51 +0000] "GET //localhost:31000/api/atlas/v2/types/typedef/name/PII_TraitbQX3KZtuHL HTTP/1.1" 404 96 "-" "Java/1.8.0_172"
127.0.0.1 - - [03/May/2018:09:45:51 +0000] "POST //localhost:31000/api/atlas/v2/types/typedefs/ HTTP/1.1" 200 425 "-" "Java/1.8.0_172"
127.0.0.1 - - [03/May/2018:09:45:51 +0000] "GET //localhost:31000/api/atlas/v2/types/classificationdef/name/PII_TraitbQX3KZtuHL HTTP/1.1" 200 332 "-" "Java/1.8.0_172"
127.0.0.1 - - [03/May/2018:09:45:51 +0000] "POST //localhost:31000/api/atlas/v2/entity/guid/1d754bb9-85c7-450b-b830-b770fa2911cb/classifications HTTP/1.1" 204 0 "-" "Java/1.8.0_172"
127.0.0.1 - - [03/May/2018:09:45:52 +0000] "GET //localhost:31000/api/atlas/v2/entity/guid/1d754bb9-85c7-450b-b830-b770fa2911cb/classifications HTTP/1.1" 200 868 "-" "Java/1.8.0_172"
127.0.0.1 - - [03/May/2018:09:45:52 +0000] "GET //localhost:31000/api/atlas/v2/entity/guid/1d754bb9-85c7-450b-b830-b770fa2911cb/classifications HTTP/1.1" 200 868 "-" "Java/1.8.0_172"
127.0.0.1 - - [03/May/2018:09:45:52 +0000] "POST //localhost:31000/api/atlas/v2/entity/ HTTP/1.1" 200 359 "-" "Java/1.8.0_172"
127.0.0.1 - - [03/May/2018:09:45:52 +0000] "GET //localhost:31000/api/atlas/v2/entity/guid/1d754bb9-85c7-450b-b830-b770fa2911cb HTTP/1.1" 200 1854 "-" "Java/1.8.0_172"
127.0.0.1 - - [03/May/2018:09:45:52 +0000] "PUT //localhost:31000/api/atlas/v2/entity/uniqueAttribute/type/hive_table_v2?attr:qualifiedName=tablemiJKqeWSIJ HTTP/1.1" 200 510 "-" "Java/1.8.0_172"
127.0.0.1 - - [03/May/2018:09:45:52 +0000] "GET //localhost:31000/api/atlas/v2/entity/guid/1d754bb9-85c7-450b-b830-b770fa2911cb HTTP/1.1" 200 1930 "-" "Java/1.8.0_172"
127.0.0.1 - - [03/May/2018:09:46:12 +0000] "GET //localhost:31000/api/atlas/v2/types/typedef/name/PII_TraitFtGfR5CgYy HTTP/1.1" 404 96 "-" "Java/1.8.0_172"
127.0.0.1 - - [03/May/2018:09:46:12 +0000] "POST //localhost:31000/api/atlas/v2/types/typedefs/ HTTP/1.1" 200 425 "-" "Java/1.8.0_172"
127.0.0.1 - - [03/May/2018:09:46:13 +0000] "POST //localhost:31000/api/atlas/v2/entity/guid/1d754bb9-85c7-450b-b830-b770fa2911cb/classifications HTTP/1.1" 204 0 "-" "Java/1.8.0_172"
127.0.0.1 - - [03/May/2018:09:46:13 +0000] "GET //localhost:31000/api/atlas/entities/1d754bb9-85c7-450b-b830-b770fa2911cb/audit?count=100 HTTP/1.1" 200 21391 "-" "Java/1.8.0_172"
127.0.0.1 - - [03/May/2018:09:46:13 +0000] "GET //localhost:31000/api/atlas/v2/types/typedef/name/PII_TraitwYa8q0S5Mf HTTP/1.1" 404 96 "-" "Java/1.8.0_172"
127.0.0.1 - - [03/May/2018:09:46:13 +0000] "POST //localhost:31000/api/atlas/v2/types/typedefs/ HTTP/1.1" 200 576 "-" "Java/1.8.0_172"
127.0.0.1 - - [03/May/2018:09:46:13 +0000] "POST //localhost:31000/api/atlas/v2/entity/guid/1d754bb9-85c7-450b-b830-b770fa2911cb/classifications HTTP/1.1" 204 0 "-" "Java/1.8.0_172"
127.0.0.1 - - [03/May/2018:09:46:14 +0000] "GET //localhost:31000/api/atlas/v2/entity/guid/1d754bb9-85c7-450b-b830-b770fa2911cb HTTP/1.1" 200 2166 "-" "Java/1.8.0_172"
127.0.0.1 - - [03/May/2018:09:46:14 +0000] "GET //localhost:31000/api/atlas/v2/types/typedef/name/PII_TraitxGPR0rZucc HTTP/1.1" 404 96 "-" "Java/1.8.0_172"
127.0.0.1 - - [03/May/2018:09:46:14 +0000] "POST //localhost:31000/api/atlas/v2/types/typedefs/ HTTP/1.1" 200 425 "-" "Java/1.8.0_172"
127.0.0.1 - - [03/May/2018:09:46:14 +0000] "POST //localhost:31000/api/atlas/v2/entity/guid/1d754bb9-85c7-450b-b830-b770fa2911cb/classifications HTTP/1.1" 204 0 "-" "Java/1.8.0_172"
127.0.0.1 - - [03/May/2018:09:46:14 +0000] "GET //localhost:31000/api/atlas/entities/1d754bb9-85c7-450b-b830-b770fa2911cb/audit?count=100 HTTP/1.1" 200 22089 "-" "Java/1.8.0_172"
127.0.0.1 - - [03/May/2018:09:46:14 +0000] "GET //localhost:31000/api/atlas/v2/entity/guid/1d754bb9-85c7-450b-b830-b770fa2911cb/classifications HTTP/1.1" 200 1315 "-" "Java/1.8.0_172"
127.0.0.1 - - [03/May/2018:09:46:14 +0000] "DELETE //localhost:31000/api/atlas/v2/entity/guid/1d754bb9-85c7-450b-b830-b770fa2911cb/classification/PII_TraitxGPR0rZucc HTTP/1.1" 204 0 "-" "Java/1.8.0_172"
127.0.0.1 - - [03/May/2018:09:46:14 +0000] "GET //localhost:31000/api/atlas/entities/1d754bb9-85c7-450b-b830-b770fa2911cb/audit?count=100 HTTP/1.1" 200 22320 "-" "Java/1.8.0_172"
Tests run: 123, Failures: 4, Errors: 0, Skipped: 0, Time elapsed: 172.543 sec <<< FAILURE! - in TestSuite
testEnterEmptyValues(org.apache.atlas.CredentialProviderUtilityIT)  Time elapsed: 0.898 sec  <<< FAILURE!
java.io.IOException: Invalid secret key format
	at com.sun.crypto.provider.JceKeyStore.engineLoad(JceKeyStore.java:856)
	at java.security.KeyStore.load(KeyStore.java:1445)
	at org.apache.hadoop.security.alias.AbstractJavaKeyStoreProvider.<init>(AbstractJavaKeyStoreProvider.java:106)
	at org.apache.hadoop.security.alias.JavaKeyStoreProvider.<init>(JavaKeyStoreProvider.java:49)
	at org.apache.hadoop.security.alias.JavaKeyStoreProvider.<init>(JavaKeyStoreProvider.java:41)
	at org.apache.hadoop.security.alias.JavaKeyStoreProvider$Factory.createProvider(JavaKeyStoreProvider.java:100)
	at org.apache.hadoop.security.alias.CredentialProviderFactory.getProviders(CredentialProviderFactory.java:58)
	at org.apache.atlas.CredentialProviderUtilityIT.testEnterEmptyValues(CredentialProviderUtilityIT.java:138)

testEnterMismatchedValues(org.apache.atlas.CredentialProviderUtilityIT)  Time elapsed: 0.67 sec  <<< FAILURE!
java.io.IOException: Invalid secret key format
	at com.sun.crypto.provider.JceKeyStore.engineLoad(JceKeyStore.java:856)
	at java.security.KeyStore.load(KeyStore.java:1445)
	at org.apache.hadoop.security.alias.AbstractJavaKeyStoreProvider.<init>(AbstractJavaKeyStoreProvider.java:106)
	at org.apache.hadoop.security.alias.JavaKeyStoreProvider.<init>(JavaKeyStoreProvider.java:49)
	at org.apache.hadoop.security.alias.JavaKeyStoreProvider.<init>(JavaKeyStoreProvider.java:41)
	at org.apache.hadoop.security.alias.JavaKeyStoreProvider$Factory.createProvider(JavaKeyStoreProvider.java:100)
	at org.apache.hadoop.security.alias.CredentialProviderFactory.getProviders(CredentialProviderFactory.java:58)
	at org.apache.atlas.CredentialProviderUtilityIT.testEnterMismatchedValues(CredentialProviderUtilityIT.java:192)

testEnterValidValues(org.apache.atlas.CredentialProviderUtilityIT)  Time elapsed: 0.685 sec  <<< FAILURE!
java.io.IOException: Invalid secret key format
	at com.sun.crypto.provider.JceKeyStore.engineLoad(JceKeyStore.java:856)
	at java.security.KeyStore.load(KeyStore.java:1445)
	at org.apache.hadoop.security.alias.AbstractJavaKeyStoreProvider.<init>(AbstractJavaKeyStoreProvider.java:106)
	at org.apache.hadoop.security.alias.JavaKeyStoreProvider.<init>(JavaKeyStoreProvider.java:49)
	at org.apache.hadoop.security.alias.JavaKeyStoreProvider.<init>(JavaKeyStoreProvider.java:41)
	at org.apache.hadoop.security.alias.JavaKeyStoreProvider$Factory.createProvider(JavaKeyStoreProvider.java:100)
	at org.apache.hadoop.security.alias.CredentialProviderFactory.getProviders(CredentialProviderFactory.java:58)
	at org.apache.atlas.CredentialProviderUtilityIT.testEnterValidValues(CredentialProviderUtilityIT.java:76)

testOverwriteValues(org.apache.atlas.CredentialProviderUtilityIT)  Time elapsed: 0.634 sec  <<< FAILURE!
java.io.IOException: Invalid secret key format
	at com.sun.crypto.provider.JceKeyStore.engineLoad(JceKeyStore.java:856)
	at java.security.KeyStore.load(KeyStore.java:1445)
	at org.apache.hadoop.security.alias.AbstractJavaKeyStoreProvider.<init>(AbstractJavaKeyStoreProvider.java:106)
	at org.apache.hadoop.security.alias.JavaKeyStoreProvider.<init>(JavaKeyStoreProvider.java:49)
	at org.apache.hadoop.security.alias.JavaKeyStoreProvider.<init>(JavaKeyStoreProvider.java:41)
	at org.apache.hadoop.security.alias.JavaKeyStoreProvider$Factory.createProvider(JavaKeyStoreProvider.java:100)
	at org.apache.hadoop.security.alias.CredentialProviderFactory.getProviders(CredentialProviderFactory.java:58)
	at org.apache.atlas.util.CredentialProviderUtility.getCredentialProvider(CredentialProviderUtility.java:150)
	at org.apache.atlas.util.CredentialProviderUtility.main(CredentialProviderUtility.java:75)
	at org.apache.atlas.CredentialProviderUtilityIT.testOverwriteValues(CredentialProviderUtilityIT.java:251)


Results :

Failed tests: 
  CredentialProviderUtilityIT.testEnterEmptyValues:138 » IO Invalid secret key f...
  CredentialProviderUtilityIT.testEnterMismatchedValues:192 » IO Invalid secret ...
  CredentialProviderUtilityIT.testEnterValidValues:76 » IO Invalid secret key fo...
  CredentialProviderUtilityIT.testOverwriteValues:251 » IO Invalid secret key fo...

Tests run: 123, Failures: 4, Errors: 0, Skipped: 0

[INFO] 
[INFO] --- jetty-maven-plugin:9.3.14.v20161028:stop (stop-jetty) @ atlas-webapp ---
[INFO] Waiting 10 seconds for jetty to stop
[INFO] Stopped ServerConnector@3e47def7{HTTP/1.1,[http/1.1]}{0.0.0.0:31000}
[INFO] Closing Spring root WebApplicationContext
[INFO] Shutting down log4j
[INFO] Stopped o.e.j.m.p.JettyWebAppContext@4c4dc0c3{/,file://<https://builds.apache.org/job/Atlas-master-IntegrationTests/ws/webapp/target/atlas-webapp-1.0.0-SNAPSHOT/,UNAVAILABLE}{/home/jenkins/jenkins-slave/workspace/Atlas-master-IntegrationTests/webapp/target/atlas-webapp-1.0.0-SNAPSHOT.war}>
[INFO] Server reports itself as stopped
[INFO] 
[INFO] --- maven-source-plugin:2.4:jar-no-fork (attach-sources) @ atlas-webapp ---
[INFO] Building jar: <https://builds.apache.org/job/Atlas-master-IntegrationTests/ws/webapp/target/atlas-webapp-1.0.0-SNAPSHOT-sources.jar>
log4j:WARN No appenders could be found for logger (org.apache.zookeeper.ClientCnxn).
log4j:WARN Please initialize the log4j system properly.
log4j:WARN See http://logging.apache.org/log4j/1.2/faq.html#noconfig for more info.
[INFO] 
[INFO] --- maven-source-plugin:2.4:test-jar-no-fork (attach-sources) @ atlas-webapp ---
[INFO] Building jar: <https://builds.apache.org/job/Atlas-master-IntegrationTests/ws/webapp/target/atlas-webapp-1.0.0-SNAPSHOT-test-sources.jar>
[INFO] 
[INFO] --- maven-failsafe-plugin:2.18.1:verify (verify) @ atlas-webapp ---
[INFO] Failsafe report directory: <https://builds.apache.org/job/Atlas-master-IntegrationTests/ws/webapp/target/failsafe-reports>
[INFO] ------------------------------------------------------------------------
[INFO] Reactor Summary:
[INFO] 
[INFO] Apache Atlas Server Build Tools .................... SUCCESS [  1.530 s]
[INFO] apache-atlas ....................................... SUCCESS [  5.817 s]
[INFO] Apache Atlas Test Utility Tools .................... SUCCESS [ 15.997 s]
[INFO] Open Connector Framework (OCF) ..................... SUCCESS [ 17.543 s]
[INFO] Open Metadata Repository Services (OMRS) ........... SUCCESS [ 47.076 s]
[INFO] Open Metadata and Governance (OMAG) Server APIs .... SUCCESS [ 10.447 s]
[INFO] Connected Asset Open Metadata Access Service (OMAS)  SUCCESS [ 12.226 s]
[INFO] Asset Consumer Open Metadata Access Service (OMAS) . SUCCESS [ 12.006 s]
[INFO] Open Metadata and Governance (OMAG) Server ......... SUCCESS [  5.099 s]
[INFO] Apache Atlas Integration ........................... SUCCESS [ 28.499 s]
[INFO] Apache Atlas Common ................................ SUCCESS [ 10.561 s]
[INFO] Apache Atlas Client ................................ SUCCESS [  0.556 s]
[INFO] atlas-client-common ................................ SUCCESS [  8.383 s]
[INFO] atlas-client-v1 .................................... SUCCESS [  9.222 s]
[INFO] Apache Atlas Server API ............................ SUCCESS [  7.700 s]
[INFO] Apache Atlas Notification .......................... SUCCESS [ 12.790 s]
[INFO] atlas-client-v2 .................................... SUCCESS [  7.693 s]
[INFO] Apache Atlas Graph Database Projects ............... SUCCESS [  0.471 s]
[INFO] Apache Atlas Graph Database API .................... SUCCESS [  6.074 s]
[INFO] Graph Database Common Code ......................... SUCCESS [  6.714 s]
[INFO] Apache Atlas JanusGraph DB Impl .................... SUCCESS [ 16.745 s]
[INFO] Apache Atlas Graph Database Implementation Dependencies SUCCESS [  2.455 s]
[INFO] Shaded version of Apache hbase client .............. SUCCESS [ 10.696 s]
[INFO] Apache Atlas Titan 0.5.4 Graph DB Impl ............. SUCCESS [ 49.387 s]
[INFO] Shaded version of Apache hbase server .............. SUCCESS [ 27.004 s]
[INFO] Apache Atlas Authorization ......................... SUCCESS [  9.958 s]
[INFO] Apache Atlas Repository ............................ SUCCESS [ 44.063 s]
[INFO] Apache Atlas UI .................................... SUCCESS [02:06 min]
[INFO] Apache Atlas Web Application ....................... FAILURE [04:31 min]
[INFO] Apache Atlas Documentation ......................... SKIPPED
[INFO] Apache Atlas FileSystem Model ...................... SKIPPED
[INFO] Apache Atlas Plugin Classloader .................... SKIPPED
[INFO] Apache Atlas Hive Bridge Shim ...................... SKIPPED
[INFO] Apache Atlas Hive Bridge ........................... SKIPPED
[INFO] Apache Atlas Falcon Bridge Shim .................... SKIPPED
[INFO] Apache Atlas Falcon Bridge ......................... SKIPPED
[INFO] Apache Atlas Sqoop Bridge Shim ..................... SKIPPED
[INFO] Apache Atlas Sqoop Bridge .......................... SKIPPED
[INFO] Apache Atlas Storm Bridge Shim ..................... SKIPPED
[INFO] Apache Atlas Storm Bridge .......................... SKIPPED
[INFO] Apache Atlas Hbase Bridge Shim ..................... SKIPPED
[INFO] Apache Atlas Hbase Bridge .......................... SKIPPED
[INFO] Apache Atlas Kafka Bridge .......................... SKIPPED
[INFO] Apache Atlas Migration Exporter .................... SKIPPED
[INFO] Apache Atlas Distribution .......................... SKIPPED
[INFO] ------------------------------------------------------------------------
[INFO] BUILD FAILURE
[INFO] ------------------------------------------------------------------------
[INFO] Total time: 13:07 min
[INFO] Finished at: 2018-05-03T09:46:19Z
[INFO] Final Memory: 392M/2006M
[INFO] ------------------------------------------------------------------------
[ERROR] Failed to execute goal org.apache.maven.plugins:maven-failsafe-plugin:2.18.1:verify (verify) on project atlas-webapp: There are test failures.
[ERROR] 
[ERROR] Please refer to <https://builds.apache.org/job/Atlas-master-IntegrationTests/ws/webapp/target/failsafe-reports> for the individual test results.
[ERROR] -> [Help 1]
[ERROR] 
[ERROR] To see the full stack trace of the errors, re-run Maven with the -e switch.
[ERROR] Re-run Maven using the -X switch to enable full debug logging.
[ERROR] 
[ERROR] For more information about the errors and possible solutions, please read the following articles:
[ERROR] [Help 1] http://cwiki.apache.org/confluence/display/MAVEN/MojoFailureException
[ERROR] 
[ERROR] After correcting the problems, you can resume the build with the command
[ERROR]   mvn <goals> -rf :atlas-webapp
Build step 'Execute shell' marked build as failure
[CHECKSTYLE] Collecting checkstyle analysis files...
[CHECKSTYLE] Searching for all files in <https://builds.apache.org/job/Atlas-master-IntegrationTests/ws/> that match the pattern **/target/checkstyle-result.xml
[CHECKSTYLE] Parsing 27 files in <https://builds.apache.org/job/Atlas-master-IntegrationTests/ws/>
[CHECKSTYLE] Successfully parsed file <https://builds.apache.org/job/Atlas-master-IntegrationTests/ws/authorization/target/checkstyle-result.xml> with 669 unique warnings and 0 duplicates.
[CHECKSTYLE] Successfully parsed file <https://builds.apache.org/job/Atlas-master-IntegrationTests/ws/client/client-v1/target/checkstyle-result.xml> with 1556 unique warnings and 0 duplicates.
[CHECKSTYLE] Successfully parsed file <https://builds.apache.org/job/Atlas-master-IntegrationTests/ws/client/client-v2/target/checkstyle-result.xml> with 1915 unique warnings and 0 duplicates.
[CHECKSTYLE] Successfully parsed file <https://builds.apache.org/job/Atlas-master-IntegrationTests/ws/client/common/target/checkstyle-result.xml> with 2406 unique warnings and 0 duplicates.
[CHECKSTYLE] Successfully parsed file <https://builds.apache.org/job/Atlas-master-IntegrationTests/ws/client/target/checkstyle-result.xml> with 2406 unique warnings and 0 duplicates.
[CHECKSTYLE] Successfully parsed file <https://builds.apache.org/job/Atlas-master-IntegrationTests/ws/common/target/checkstyle-result.xml> with 3463 unique warnings and 0 duplicates.
[CHECKSTYLE] Successfully parsed file <https://builds.apache.org/job/Atlas-master-IntegrationTests/ws/dashboardv2/target/checkstyle-result.xml> with 3463 unique warnings and 0 duplicates.
[CHECKSTYLE] Successfully parsed file <https://builds.apache.org/job/Atlas-master-IntegrationTests/ws/graphdb/api/target/checkstyle-result.xml> with 3763 unique warnings and 0 duplicates.
[CHECKSTYLE] Successfully parsed file <https://builds.apache.org/job/Atlas-master-IntegrationTests/ws/graphdb/common/target/checkstyle-result.xml> with 3989 unique warnings and 0 duplicates.
[CHECKSTYLE] Successfully parsed file <https://builds.apache.org/job/Atlas-master-IntegrationTests/ws/graphdb/graphdb-impls/target/checkstyle-result.xml> with 3989 unique warnings and 0 duplicates.
[CHECKSTYLE] Successfully parsed file <https://builds.apache.org/job/Atlas-master-IntegrationTests/ws/graphdb/janus/target/checkstyle-result.xml> with 5767 unique warnings and 0 duplicates.
[CHECKSTYLE] Successfully parsed file <https://builds.apache.org/job/Atlas-master-IntegrationTests/ws/graphdb/target/checkstyle-result.xml> with 5767 unique warnings and 0 duplicates.
[CHECKSTYLE] Successfully parsed file <https://builds.apache.org/job/Atlas-master-IntegrationTests/ws/graphdb/titan0/target/checkstyle-result.xml> with 8271 unique warnings and 0 duplicates.
[CHECKSTYLE] Successfully parsed file <https://builds.apache.org/job/Atlas-master-IntegrationTests/ws/intg/target/checkstyle-result.xml> with 20093 unique warnings and 0 duplicates.
[CHECKSTYLE] Successfully parsed file <https://builds.apache.org/job/Atlas-master-IntegrationTests/ws/notification/target/checkstyle-result.xml> with 21329 unique warnings and 0 duplicates.
[CHECKSTYLE] Successfully parsed file <https://builds.apache.org/job/Atlas-master-IntegrationTests/ws/om-fwk-ocf/target/checkstyle-result.xml> with 26370 unique warnings and 0 duplicates.
[CHECKSTYLE] Successfully parsed file <https://builds.apache.org/job/Atlas-master-IntegrationTests/ws/omag-api/target/checkstyle-result.xml> with 27925 unique warnings and 0 duplicates.
[CHECKSTYLE] Successfully parsed file <https://builds.apache.org/job/Atlas-master-IntegrationTests/ws/omag-server/target/checkstyle-result.xml> with 27934 unique warnings and 0 duplicates.
[CHECKSTYLE] Successfully parsed file <https://builds.apache.org/job/Atlas-master-IntegrationTests/ws/omas-assetconsumer/target/checkstyle-result.xml> with 30773 unique warnings and 0 duplicates.
[CHECKSTYLE] Successfully parsed file <https://builds.apache.org/job/Atlas-master-IntegrationTests/ws/omas-connectedasset/target/checkstyle-result.xml> with 34186 unique warnings and 0 duplicates.
[CHECKSTYLE] Successfully parsed file <https://builds.apache.org/job/Atlas-master-IntegrationTests/ws/omrs/target/checkstyle-result.xml> with 74157 unique warnings and 0 duplicates.
[CHECKSTYLE] Successfully parsed file <https://builds.apache.org/job/Atlas-master-IntegrationTests/ws/repository/target/checkstyle-result.xml> with 94003 unique warnings and 0 duplicates.
[CHECKSTYLE] Successfully parsed file <https://builds.apache.org/job/Atlas-master-IntegrationTests/ws/server-api/target/checkstyle-result.xml> with 94169 unique warnings and 0 duplicates.
[CHECKSTYLE] Successfully parsed file <https://builds.apache.org/job/Atlas-master-IntegrationTests/ws/shaded/hbase-client-shaded/target/checkstyle-result.xml> with 94169 unique warnings and 0 duplicates.
[CHECKSTYLE] Successfully parsed file <https://builds.apache.org/job/Atlas-master-IntegrationTests/ws/shaded/hbase-server-shaded/target/checkstyle-result.xml> with 94169 unique warnings and 0 duplicates.
[CHECKSTYLE] Successfully parsed file <https://builds.apache.org/job/Atlas-master-IntegrationTests/ws/target/checkstyle-result.xml> with 94169 unique warnings and 0 duplicates.
[CHECKSTYLE] Successfully parsed file <https://builds.apache.org/job/Atlas-master-IntegrationTests/ws/test-tools/target/checkstyle-result.xml> with 94207 unique warnings and 0 duplicates.
<Git Blamer> Using GitBlamer to create author and commit information for all warnings.
<Git Blamer> GIT_COMMIT=1e60ca4d98d174e5f000ef9ace38fb32238dd742, workspace=<https://builds.apache.org/job/Atlas-master-IntegrationTests/ws/>
 > git rev-parse 1e60ca4d98d174e5f000ef9ace38fb32238dd742^{commit} # timeout=10
[CHECKSTYLE] Computing warning deltas based on reference build #1179
[FINDBUGS] Collecting findbugs analysis files...
[FINDBUGS] Searching for all files in <https://builds.apache.org/job/Atlas-master-IntegrationTests/ws/> that match the pattern **/target/findbugs.xml
[FINDBUGS] Parsing 20 files in <https://builds.apache.org/job/Atlas-master-IntegrationTests/ws/>
[FINDBUGS] Successfully parsed file <https://builds.apache.org/job/Atlas-master-IntegrationTests/ws/authorization/target/findbugs.xml> with 0 unique warnings and 0 duplicates.
[FINDBUGS] Successfully parsed file <https://builds.apache.org/job/Atlas-master-IntegrationTests/ws/client/client-v1/target/findbugs.xml> with 0 unique warnings and 0 duplicates.
[FINDBUGS] Successfully parsed file <https://builds.apache.org/job/Atlas-master-IntegrationTests/ws/client/client-v2/target/findbugs.xml> with 0 unique warnings and 0 duplicates.
[FINDBUGS] Successfully parsed file <https://builds.apache.org/job/Atlas-master-IntegrationTests/ws/client/common/target/findbugs.xml> with 0 unique warnings and 0 duplicates.
[FINDBUGS] Successfully parsed file <https://builds.apache.org/job/Atlas-master-IntegrationTests/ws/common/target/findbugs.xml> with 0 unique warnings and 0 duplicates.
[FINDBUGS] Successfully parsed file <https://builds.apache.org/job/Atlas-master-IntegrationTests/ws/graphdb/api/target/findbugs.xml> with 0 unique warnings and 0 duplicates.
[FINDBUGS] Successfully parsed file <https://builds.apache.org/job/Atlas-master-IntegrationTests/ws/graphdb/common/target/findbugs.xml> with 0 unique warnings and 0 duplicates.
[FINDBUGS] Successfully parsed file <https://builds.apache.org/job/Atlas-master-IntegrationTests/ws/graphdb/janus/target/findbugs.xml> with 0 unique warnings and 0 duplicates.
[FINDBUGS] Successfully parsed file <https://builds.apache.org/job/Atlas-master-IntegrationTests/ws/graphdb/titan0/target/findbugs.xml> with 0 unique warnings and 0 duplicates.
[FINDBUGS] Successfully parsed file <https://builds.apache.org/job/Atlas-master-IntegrationTests/ws/intg/target/findbugs.xml> with 0 unique warnings and 0 duplicates.
[FINDBUGS] Successfully parsed file <https://builds.apache.org/job/Atlas-master-IntegrationTests/ws/notification/target/findbugs.xml> with 0 unique warnings and 0 duplicates.
[FINDBUGS] Successfully parsed file <https://builds.apache.org/job/Atlas-master-IntegrationTests/ws/om-fwk-ocf/target/findbugs.xml> with 0 unique warnings and 0 duplicates.
[FINDBUGS] Successfully parsed file <https://builds.apache.org/job/Atlas-master-IntegrationTests/ws/omag-api/target/findbugs.xml> with 0 unique warnings and 0 duplicates.
[FINDBUGS] Successfully parsed file <https://builds.apache.org/job/Atlas-master-IntegrationTests/ws/omag-server/target/findbugs.xml> with 0 unique warnings and 0 duplicates.
[FINDBUGS] Successfully parsed file <https://builds.apache.org/job/Atlas-master-IntegrationTests/ws/omas-assetconsumer/target/findbugs.xml> with 0 unique warnings and 0 duplicates.
[FINDBUGS] Successfully parsed file <https://builds.apache.org/job/Atlas-master-IntegrationTests/ws/omas-connectedasset/target/findbugs.xml> with 0 unique warnings and 0 duplicates.
[FINDBUGS] Successfully parsed file <https://builds.apache.org/job/Atlas-master-IntegrationTests/ws/omrs/target/findbugs.xml> with 0 unique warnings and 0 duplicates.
[FINDBUGS] Successfully parsed file <https://builds.apache.org/job/Atlas-master-IntegrationTests/ws/repository/target/findbugs.xml> with 0 unique warnings and 0 duplicates.
[FINDBUGS] Successfully parsed file <https://builds.apache.org/job/Atlas-master-IntegrationTests/ws/server-api/target/findbugs.xml> with 0 unique warnings and 0 duplicates.
[FINDBUGS] Successfully parsed file <https://builds.apache.org/job/Atlas-master-IntegrationTests/ws/test-tools/target/findbugs.xml> with 0 unique warnings and 0 duplicates.
<Git Blamer> Using GitBlamer to create author and commit information for all warnings.
<Git Blamer> GIT_COMMIT=1e60ca4d98d174e5f000ef9ace38fb32238dd742, workspace=<https://builds.apache.org/job/Atlas-master-IntegrationTests/ws/>
[FINDBUGS] Computing warning deltas based on reference build #1179
Archiving artifacts
[Fast Archiver] Compressed 165.45 MB of artifacts by 88.8% relative to #1179
TestNG Reports Processing: START
Looking for TestNG results report in workspace using pattern: **/target/surefire-reports/testng-results.xml,**/target/failsafe-reports/testng-results.xml
Saving reports...
Processing '/x1/jenkins/jenkins-home/jobs/Atlas-master-IntegrationTests/builds/1228/testng/testng-results.xml'
3.252033% of tests failed, which exceeded threshold of 0%. Marking build as UNSTABLE
TestNG Reports Processing: FINISH