git.net

[Date Prev][Date Next][Thread Prev][Thread Next][Date Index][Thread Index]

Build failed in Jenkins: PreCommit-ATLAS-Build-Test #335-master-ATLAS-2624-2-Fixed-the-case-where-same-classificatio.patch


See <https://builds.apache.org/job/PreCommit-ATLAS-Build-Test/335/display/redirect?page=changes>

Changes:

[ssubramanian] ATLAS-2588: Regression : Negative tests for tags throw 400 Bad Request

------------------------------------------
[...truncated 484.51 KB...]
127.0.0.1 - - [02/May/2018:22:53:26 +0000] "GET //localhost:31000/api/atlas/v2/types/typedef/name/testGU9xOlEZc4 HTTP/1.1" 404 91 "-" "Java/1.8.0_172"
127.0.0.1 - - [02/May/2018:22:53:26 +0000] "POST //localhost:31000/api/atlas/types HTTP/1.1" 201 109 "-" "Java/1.8.0_172"
127.0.0.1 - - [02/May/2018:22:53:26 +0000] "GET //localhost:31000/api/atlas/entities?type=testGU9xOlEZc4 HTTP/1.1" 200 124 "-" "Java/1.8.0_172"
127.0.0.1 - - [02/May/2018:22:53:26 +0000] "POST //localhost:31000/api/atlas/entities HTTP/1.1" 201 883 "-" "Java/1.8.0_172"
127.0.0.1 - - [02/May/2018:22:53:26 +0000] "POST //localhost:31000/api/atlas/entities HTTP/1.1" 201 2302 "-" "Java/1.8.0_172"
127.0.0.1 - - [02/May/2018:22:53:27 +0000] "GET //localhost:31000/api/atlas/entities/585c7513-aa14-474a-88a9-4c0e207d20b8 HTTP/1.1" 200 2088 "-" "Java/1.8.0_172"
127.0.0.1 - - [02/May/2018:22:53:27 +0000] "POST //localhost:31000/api/atlas/entities HTTP/1.1" 201 883 "-" "Java/1.8.0_172"
127.0.0.1 - - [02/May/2018:22:53:27 +0000] "POST //localhost:31000/api/atlas/entities HTTP/1.1" 201 2302 "-" "Java/1.8.0_172"
127.0.0.1 - - [02/May/2018:22:53:27 +0000] "POST //localhost:31000/api/atlas/entities/51c14d33-60a6-4e08-8e00-c91472d9f160?property=description HTTP/1.1" 200 2163 "-" "Java/1.8.0_172"
127.0.0.1 - - [02/May/2018:22:53:27 +0000] "GET //localhost:31000/api/atlas/entities/51c14d33-60a6-4e08-8e00-c91472d9f160 HTTP/1.1" 200 2099 "-" "Java/1.8.0_172"
127.0.0.1 - - [02/May/2018:22:53:27 +0000] "POST //localhost:31000/api/atlas/entities/51c14d33-60a6-4e08-8e00-c91472d9f160?property=invalid_property HTTP/1.1" 400 68 "-" "Java/1.8.0_172"
127.0.0.1 - - [02/May/2018:22:53:27 +0000] "GET //localhost:31000/api/atlas/entities/51c14d33-60a6-4e08-8e00-c91472d9f160 HTTP/1.1" 200 2099 "-" "Java/1.8.0_172"
127.0.0.1 - - [02/May/2018:22:53:27 +0000] "GET //localhost:31000/api/atlas/admin/version HTTP/1.1" 200 169 "-" "Java/1.8.0_172"
127.0.0.1 - - [02/May/2018:22:53:27 +0000] "POST //localhost:31000/api/atlas/admin/import HTTP/1.1" 200 10429 "-" "Java/1.8.0_172"
127.0.0.1 - - [02/May/2018:22:53:34 +0000] "GET //localhost:31000/api/atlas/v2/types/typedef/name/fooTag HTTP/1.1" 404 83 "-" "Java/1.8.0_172"
127.0.0.1 - - [02/May/2018:22:53:34 +0000] "POST //localhost:31000/api/atlas/v2/types/typedefs/ HTTP/1.1" 200 401 "-" "Java/1.8.0_172"
127.0.0.1 - - [02/May/2018:22:53:34 +0000] "GET //localhost:31000/api/atlas/v2/entity/uniqueAttribute/type/hdfs_path?attr:qualifiedName=test%241test%2B%2B-%2B%26%26%2B%7C%7C%2B%21%2B%28%2B%29%2B%7B%2B%7D%2B%5B%2B%5D%2B%5E%2B%3C%2B%3E%2B%3B%2B%3A%2B%22%2B%25%2B*%2B%60%2B%7E HTTP/1.1" 404 176 "-" "Java/1.8.0_172"
127.0.0.1 - - [02/May/2018:22:53:34 +0000] "POST //localhost:31000/api/atlas/v2/entity/ HTTP/1.1" 200 273 "-" "Java/1.8.0_172"
127.0.0.1 - - [02/May/2018:22:53:40 +0000] "POST //localhost:31000/api/atlas/v2/search/basic HTTP/1.1" 200 1325 "-" "Java/1.8.0_172"
127.0.0.1 - - [02/May/2018:22:53:40 +0000] "POST //localhost:31000/api/atlas/v2/search/basic HTTP/1.1" 200 984 "-" "Java/1.8.0_172"
127.0.0.1 - - [02/May/2018:22:53:40 +0000] "POST //localhost:31000/api/atlas/v2/search/basic HTTP/1.1" 200 692 "-" "Java/1.8.0_172"
127.0.0.1 - - [02/May/2018:22:53:40 +0000] "POST //localhost:31000/api/atlas/v2/search/basic HTTP/1.1" 200 1432 "-" "Java/1.8.0_172"
127.0.0.1 - - [02/May/2018:22:53:40 +0000] "POST //localhost:31000/api/atlas/v2/search/basic HTTP/1.1" 200 1479 "-" "Java/1.8.0_172"
127.0.0.1 - - [02/May/2018:22:53:40 +0000] "POST //localhost:31000/api/atlas/v2/search/basic HTTP/1.1" 200 1479 "-" "Java/1.8.0_172"
127.0.0.1 - - [02/May/2018:22:53:40 +0000] "POST //localhost:31000/api/atlas/v2/search/basic HTTP/1.1" 200 1322 "-" "Java/1.8.0_172"
127.0.0.1 - - [02/May/2018:22:53:40 +0000] "POST //localhost:31000/api/atlas/v2/search/basic HTTP/1.1" 200 795 "-" "Java/1.8.0_172"
127.0.0.1 - - [02/May/2018:22:53:40 +0000] "POST //localhost:31000/api/atlas/v2/search/basic HTTP/1.1" 200 5936 "-" "Java/1.8.0_172"
127.0.0.1 - - [02/May/2018:22:53:40 +0000] "POST //localhost:31000/api/atlas/v2/search/basic HTTP/1.1" 200 1435 "-" "Java/1.8.0_172"
127.0.0.1 - - [02/May/2018:22:53:40 +0000] "POST //localhost:31000/api/atlas/v2/search/basic HTTP/1.1" 200 1532 "-" "Java/1.8.0_172"
127.0.0.1 - - [02/May/2018:22:53:40 +0000] "POST //localhost:31000/api/atlas/v2/search/basic HTTP/1.1" 200 1467 "-" "Java/1.8.0_172"
127.0.0.1 - - [02/May/2018:22:53:40 +0000] "POST //localhost:31000/api/atlas/v2/search/basic HTTP/1.1" 200 692 "-" "Java/1.8.0_172"
127.0.0.1 - - [02/May/2018:22:53:40 +0000] "POST //localhost:31000/api/atlas/v2/search/basic HTTP/1.1" 200 759 "-" "Java/1.8.0_172"
127.0.0.1 - - [02/May/2018:22:53:40 +0000] "POST //localhost:31000/api/atlas/v2/search/basic HTTP/1.1" 200 284 "-" "Java/1.8.0_172"
127.0.0.1 - - [02/May/2018:22:53:40 +0000] "POST //localhost:31000/api/atlas/v2/search/basic HTTP/1.1" 200 1963 "-" "Java/1.8.0_172"
127.0.0.1 - - [02/May/2018:22:53:40 +0000] "POST //localhost:31000/api/atlas/v2/search/basic HTTP/1.1" 200 803 "-" "Java/1.8.0_172"
127.0.0.1 - - [02/May/2018:22:53:40 +0000] "POST //localhost:31000/api/atlas/v2/search/basic HTTP/1.1" 200 1217 "-" "Java/1.8.0_172"
127.0.0.1 - - [02/May/2018:22:53:40 +0000] "POST //localhost:31000/api/atlas/v2/search/basic HTTP/1.1" 200 896 "-" "Java/1.8.0_172"
127.0.0.1 - - [02/May/2018:22:53:41 +0000] "GET //localhost:31000/api/atlas/v2/types/typedef/name/database HTTP/1.1" 200 755 "-" "Java/1.8.0_172"
127.0.0.1 - - [02/May/2018:22:53:41 +0000] "GET //localhost:31000/api/atlas/v2/types/typedef/name/table HTTP/1.1" 200 1546 "-" "Java/1.8.0_172"
127.0.0.1 - - [02/May/2018:22:53:41 +0000] "GET //localhost:31000/api/atlas/v2/types/typedef/name/fetl HTTP/1.1" 200 451 "-" "Java/1.8.0_172"
127.0.0.1 - - [02/May/2018:22:53:41 +0000] "POST //localhost:31000/api/atlas/v2/types/typedefs/ HTTP/1.1" 200 93 "-" "Java/1.8.0_172"
127.0.0.1 - - [02/May/2018:22:53:41 +0000] "GET //localhost:31000/api/atlas/v2/types/classificationdef/name/fetl HTTP/1.1" 200 451 "-" "Java/1.8.0_172"
127.0.0.1 - - [02/May/2018:22:53:41 +0000] "GET //localhost:31000/api/atlas/v2/types/entitydef/name/database HTTP/1.1" 200 755 "-" "Java/1.8.0_172"
127.0.0.1 - - [02/May/2018:22:53:41 +0000] "GET //localhost:31000/api/atlas/v2/types/entitydef/name/table HTTP/1.1" 200 1546 "-" "Java/1.8.0_172"
127.0.0.1 - - [02/May/2018:22:53:41 +0000] "POST //localhost:31000/api/atlas/v2/types/typedefs/ HTTP/1.1" 200 532 "-" "Java/1.8.0_172"
127.0.0.1 - - [02/May/2018:22:53:41 +0000] "POST //localhost:31000/api/atlas/v2/types/typedefs/ HTTP/1.1" 409 86 "-" "Java/1.8.0_172"
127.0.0.1 - - [02/May/2018:22:53:41 +0000] "GET //localhost:31000/api/atlas/v2/types/enumdef/name/blah HTTP/1.1" 404 81 "-" "Java/1.8.0_172"
127.0.0.1 - - [02/May/2018:22:53:41 +0000] "GET //localhost:31000/api/atlas/v2/types/enumdef/guid/blah HTTP/1.1" 404 82 "-" "Java/1.8.0_172"
127.0.0.1 - - [02/May/2018:22:53:41 +0000] "GET //localhost:31000/api/atlas/v2/types/structdef/name/blah HTTP/1.1" 404 81 "-" "Java/1.8.0_172"
127.0.0.1 - - [02/May/2018:22:53:41 +0000] "GET //localhost:31000/api/atlas/v2/types/structdef/guid/blah HTTP/1.1" 404 82 "-" "Java/1.8.0_172"
127.0.0.1 - - [02/May/2018:22:53:41 +0000] "GET //localhost:31000/api/atlas/v2/types/classificationdef/name/blah HTTP/1.1" 404 81 "-" "Java/1.8.0_172"
127.0.0.1 - - [02/May/2018:22:53:41 +0000] "GET //localhost:31000/api/atlas/v2/types/classificationdef/guid/blah HTTP/1.1" 404 82 "-" "Java/1.8.0_172"
127.0.0.1 - - [02/May/2018:22:53:41 +0000] "GET //localhost:31000/api/atlas/v2/types/entitydef/name/blah HTTP/1.1" 404 81 "-" "Java/1.8.0_172"
127.0.0.1 - - [02/May/2018:22:53:41 +0000] "GET //localhost:31000/api/atlas/v2/types/entitydef/guid/blah HTTP/1.1" 404 82 "-" "Java/1.8.0_172"
127.0.0.1 - - [02/May/2018:22:53:41 +0000] "POST //localhost:31000/api/atlas/v2/types/typedefs/ HTTP/1.1" 200 1947 "-" "Java/1.8.0_172"
127.0.0.1 - - [02/May/2018:22:53:41 +0000] "GET //localhost:31000/api/atlas/v2/types/typedefs/?supertype=AMCSmoKRecx&type=CLASS HTTP/1.1" 200 1020 "-" "Java/1.8.0_172"
127.0.0.1 - - [02/May/2018:22:53:41 +0000] "GET //localhost:31000/api/atlas/v2/types/typedefs/?supertype=AMCSmoKRecx&type=CLASS&notsupertype=BoJdd1QC2Nd HTTP/1.1" 200 550 "-" "Java/1.8.0_172"
127.0.0.1 - - [02/May/2018:22:53:41 +0000] "POST //localhost:31000/api/atlas/v2/types/typedefs/ HTTP/1.1" 200 532 "-" "Java/1.8.0_172"
127.0.0.1 - - [02/May/2018:22:53:41 +0000] "PUT //localhost:31000/api/atlas/v2/types/typedefs/ HTTP/1.1" 200 691 "-" "Java/1.8.0_172"
127.0.0.1 - - [02/May/2018:22:53:41 +0000] "GET //localhost:31000/api/atlas/v2/types/typedefs/?type=ENTITY HTTP/1.1" 200 68412 "-" "Java/1.8.0_172"
127.0.0.1 - - [02/May/2018:22:53:41 +0000] "GET //localhost:31000/api/atlas/v2/types/classificationdef/name/fetl HTTP/1.1" 200 451 "-" "Java/1.8.0_172"
127.0.0.1 - - [02/May/2018:22:53:41 +0000] "GET //localhost:31000/api/atlas/v2/types/entitydef/name/database HTTP/1.1" 200 755 "-" "Java/1.8.0_172"
127.0.0.1 - - [02/May/2018:22:53:41 +0000] "GET //localhost:31000/api/atlas/v2/types/entitydef/name/table HTTP/1.1" 200 1546 "-" "Java/1.8.0_172"
Tests run: 123, Failures: 4, Errors: 0, Skipped: 0, Time elapsed: 114.48 sec <<< FAILURE! - in TestSuite
testEnterEmptyValues(org.apache.atlas.CredentialProviderUtilityIT)  Time elapsed: 0.912 sec  <<< FAILURE!
java.io.IOException: Invalid secret key format
	at com.sun.crypto.provider.JceKeyStore.engineLoad(JceKeyStore.java:856)
	at java.security.KeyStore.load(KeyStore.java:1445)
	at org.apache.hadoop.security.alias.AbstractJavaKeyStoreProvider.<init>(AbstractJavaKeyStoreProvider.java:106)
	at org.apache.hadoop.security.alias.JavaKeyStoreProvider.<init>(JavaKeyStoreProvider.java:49)
	at org.apache.hadoop.security.alias.JavaKeyStoreProvider.<init>(JavaKeyStoreProvider.java:41)
	at org.apache.hadoop.security.alias.JavaKeyStoreProvider$Factory.createProvider(JavaKeyStoreProvider.java:100)
	at org.apache.hadoop.security.alias.CredentialProviderFactory.getProviders(CredentialProviderFactory.java:58)
	at org.apache.atlas.CredentialProviderUtilityIT.testEnterEmptyValues(CredentialProviderUtilityIT.java:138)

testEnterMismatchedValues(org.apache.atlas.CredentialProviderUtilityIT)  Time elapsed: 0.573 sec  <<< FAILURE!
java.io.IOException: Invalid secret key format
	at com.sun.crypto.provider.JceKeyStore.engineLoad(JceKeyStore.java:856)
	at java.security.KeyStore.load(KeyStore.java:1445)
	at org.apache.hadoop.security.alias.AbstractJavaKeyStoreProvider.<init>(AbstractJavaKeyStoreProvider.java:106)
	at org.apache.hadoop.security.alias.JavaKeyStoreProvider.<init>(JavaKeyStoreProvider.java:49)
	at org.apache.hadoop.security.alias.JavaKeyStoreProvider.<init>(JavaKeyStoreProvider.java:41)
	at org.apache.hadoop.security.alias.JavaKeyStoreProvider$Factory.createProvider(JavaKeyStoreProvider.java:100)
	at org.apache.hadoop.security.alias.CredentialProviderFactory.getProviders(CredentialProviderFactory.java:58)
	at org.apache.atlas.CredentialProviderUtilityIT.testEnterMismatchedValues(CredentialProviderUtilityIT.java:192)

testEnterValidValues(org.apache.atlas.CredentialProviderUtilityIT)  Time elapsed: 0.587 sec  <<< FAILURE!
java.io.IOException: Invalid secret key format
	at com.sun.crypto.provider.JceKeyStore.engineLoad(JceKeyStore.java:856)
	at java.security.KeyStore.load(KeyStore.java:1445)
	at org.apache.hadoop.security.alias.AbstractJavaKeyStoreProvider.<init>(AbstractJavaKeyStoreProvider.java:106)
	at org.apache.hadoop.security.alias.JavaKeyStoreProvider.<init>(JavaKeyStoreProvider.java:49)
	at org.apache.hadoop.security.alias.JavaKeyStoreProvider.<init>(JavaKeyStoreProvider.java:41)
	at org.apache.hadoop.security.alias.JavaKeyStoreProvider$Factory.createProvider(JavaKeyStoreProvider.java:100)
	at org.apache.hadoop.security.alias.CredentialProviderFactory.getProviders(CredentialProviderFactory.java:58)
	at org.apache.atlas.CredentialProviderUtilityIT.testEnterValidValues(CredentialProviderUtilityIT.java:76)

testOverwriteValues(org.apache.atlas.CredentialProviderUtilityIT)  Time elapsed: 0.599 sec  <<< FAILURE!
java.io.IOException: Invalid secret key format
	at com.sun.crypto.provider.JceKeyStore.engineLoad(JceKeyStore.java:856)
	at java.security.KeyStore.load(KeyStore.java:1445)
	at org.apache.hadoop.security.alias.AbstractJavaKeyStoreProvider.<init>(AbstractJavaKeyStoreProvider.java:106)
	at org.apache.hadoop.security.alias.JavaKeyStoreProvider.<init>(JavaKeyStoreProvider.java:49)
	at org.apache.hadoop.security.alias.JavaKeyStoreProvider.<init>(JavaKeyStoreProvider.java:41)
	at org.apache.hadoop.security.alias.JavaKeyStoreProvider$Factory.createProvider(JavaKeyStoreProvider.java:100)
	at org.apache.hadoop.security.alias.CredentialProviderFactory.getProviders(CredentialProviderFactory.java:58)
	at org.apache.atlas.util.CredentialProviderUtility.getCredentialProvider(CredentialProviderUtility.java:150)
	at org.apache.atlas.util.CredentialProviderUtility.main(CredentialProviderUtility.java:75)
	at org.apache.atlas.CredentialProviderUtilityIT.testOverwriteValues(CredentialProviderUtilityIT.java:251)


Results :

Failed tests: 
  CredentialProviderUtilityIT.testEnterEmptyValues:138 » IO Invalid secret key f...
  CredentialProviderUtilityIT.testEnterMismatchedValues:192 » IO Invalid secret ...
  CredentialProviderUtilityIT.testEnterValidValues:76 » IO Invalid secret key fo...
  CredentialProviderUtilityIT.testOverwriteValues:251 » IO Invalid secret key fo...

Tests run: 123, Failures: 4, Errors: 0, Skipped: 0

[INFO] 
[INFO] --- jetty-maven-plugin:9.3.14.v20161028:stop (stop-jetty) @ atlas-webapp ---
[INFO] Waiting 10 seconds for jetty to stop
[INFO] Stopped ServerConnector@2e129bbd{HTTP/1.1,[http/1.1]}{0.0.0.0:31000}
[INFO] Closing Spring root WebApplicationContext
[INFO] Shutting down log4j
[INFO] Stopped o.e.j.m.p.JettyWebAppContext@39a5334b{/,file://<https://builds.apache.org/job/PreCommit-ATLAS-Build-Test/ws/webapp/target/atlas-webapp-1.0.0-SNAPSHOT/,UNAVAILABLE}{/home/jenkins/jenkins-slave/workspace/PreCommit-ATLAS-Build-Test/webapp/target/atlas-webapp-1.0.0-SNAPSHOT.war}>
[INFO] Server reports itself as stopped
[INFO] 
[INFO] --- maven-source-plugin:2.4:jar-no-fork (attach-sources) @ atlas-webapp ---
[INFO] Building jar: <https://builds.apache.org/job/PreCommit-ATLAS-Build-Test/ws/webapp/target/atlas-webapp-1.0.0-SNAPSHOT-sources.jar>
log4j:WARN No appenders could be found for logger (org.apache.zookeeper.ClientCnxn).
log4j:WARN Please initialize the log4j system properly.
log4j:WARN See http://logging.apache.org/log4j/1.2/faq.html#noconfig for more info.
[INFO] 
[INFO] --- maven-source-plugin:2.4:test-jar-no-fork (attach-sources) @ atlas-webapp ---
[INFO] Building jar: <https://builds.apache.org/job/PreCommit-ATLAS-Build-Test/ws/webapp/target/atlas-webapp-1.0.0-SNAPSHOT-test-sources.jar>
[INFO] 
[INFO] --- maven-failsafe-plugin:2.18.1:verify (verify) @ atlas-webapp ---
[INFO] Failsafe report directory: <https://builds.apache.org/job/PreCommit-ATLAS-Build-Test/ws/webapp/target/failsafe-reports>
[INFO] ------------------------------------------------------------------------
[INFO] Reactor Summary:
[INFO] 
[INFO] Apache Atlas Server Build Tools .................... SUCCESS [  0.777 s]
[INFO] apache-atlas ....................................... SUCCESS [  3.390 s]
[INFO] Apache Atlas Test Utility Tools .................... SUCCESS [  4.674 s]
[INFO] Open Connector Framework (OCF) ..................... SUCCESS [  1.926 s]
[INFO] Open Metadata Repository Services (OMRS) ........... SUCCESS [  5.830 s]
[INFO] Open Metadata and Governance (OMAG) Server APIs .... SUCCESS [  1.032 s]
[INFO] Connected Asset Open Metadata Access Service (OMAS)  SUCCESS [  1.157 s]
[INFO] Asset Consumer Open Metadata Access Service (OMAS) . SUCCESS [  1.244 s]
[INFO] Open Metadata and Governance (OMAG) Server ......... SUCCESS [  0.799 s]
[INFO] Apache Atlas Integration ........................... SUCCESS [ 38.527 s]
[INFO] Apache Atlas Common ................................ SUCCESS [  2.158 s]
[INFO] Apache Atlas Client ................................ SUCCESS [  0.141 s]
[INFO] atlas-client-common ................................ SUCCESS [  0.668 s]
[INFO] atlas-client-v1 .................................... SUCCESS [  2.596 s]
[INFO] Apache Atlas Server API ............................ SUCCESS [  0.785 s]
[INFO] Apache Atlas Notification .......................... SUCCESS [ 15.361 s]
[INFO] atlas-client-v2 .................................... SUCCESS [  0.678 s]
[INFO] Apache Atlas Graph Database Projects ............... SUCCESS [  0.084 s]
[INFO] Apache Atlas Graph Database API .................... SUCCESS [  0.713 s]
[INFO] Graph Database Common Code ......................... SUCCESS [  0.754 s]
[INFO] Apache Atlas JanusGraph DB Impl .................... SUCCESS [02:27 min]
[INFO] Apache Atlas Graph Database Implementation Dependencies SUCCESS [  1.874 s]
[INFO] Shaded version of Apache hbase client .............. SUCCESS [  7.762 s]
[INFO] Apache Atlas Titan 0.5.4 Graph DB Impl ............. SUCCESS [ 28.643 s]
[INFO] Shaded version of Apache hbase server .............. SUCCESS [ 20.188 s]
[INFO] Apache Atlas Authorization ......................... SUCCESS [  2.413 s]
[INFO] Apache Atlas Repository ............................ SUCCESS [03:04 min]
[INFO] Apache Atlas UI .................................... SUCCESS [01:41 min]
[INFO] Apache Atlas Web Application ....................... FAILURE [07:53 min]
[INFO] Apache Atlas Documentation ......................... SKIPPED
[INFO] Apache Atlas FileSystem Model ...................... SKIPPED
[INFO] Apache Atlas Plugin Classloader .................... SKIPPED
[INFO] Apache Atlas Hive Bridge Shim ...................... SKIPPED
[INFO] Apache Atlas Hive Bridge ........................... SKIPPED
[INFO] Apache Atlas Falcon Bridge Shim .................... SKIPPED
[INFO] Apache Atlas Falcon Bridge ......................... SKIPPED
[INFO] Apache Atlas Sqoop Bridge Shim ..................... SKIPPED
[INFO] Apache Atlas Sqoop Bridge .......................... SKIPPED
[INFO] Apache Atlas Storm Bridge Shim ..................... SKIPPED
[INFO] Apache Atlas Storm Bridge .......................... SKIPPED
[INFO] Apache Atlas Hbase Bridge Shim ..................... SKIPPED
[INFO] Apache Atlas Hbase Bridge .......................... SKIPPED
[INFO] Apache Atlas Kafka Bridge .......................... SKIPPED
[INFO] Apache Atlas Migration Exporter .................... SKIPPED
[INFO] Apache Atlas Distribution .......................... SKIPPED
[INFO] ------------------------------------------------------------------------
[INFO] BUILD FAILURE
[INFO] ------------------------------------------------------------------------
[INFO] Total time: 17:32 min
[INFO] Finished at: 2018-05-02T22:53:47Z
[INFO] Final Memory: 380M/2206M
[INFO] ------------------------------------------------------------------------
[ERROR] Failed to execute goal org.apache.maven.plugins:maven-failsafe-plugin:2.18.1:verify (verify) on project atlas-webapp: There are test failures.
[ERROR] 
[ERROR] Please refer to <https://builds.apache.org/job/PreCommit-ATLAS-Build-Test/ws/webapp/target/failsafe-reports> for the individual test results.
[ERROR] -> [Help 1]
[ERROR] 
[ERROR] To see the full stack trace of the errors, re-run Maven with the -e switch.
[ERROR] Re-run Maven using the -X switch to enable full debug logging.
[ERROR] 
[ERROR] For more information about the errors and possible solutions, please read the following articles:
[ERROR] [Help 1] http://cwiki.apache.org/confluence/display/MAVEN/MojoFailureException
[ERROR] 
[ERROR] After correcting the problems, you can resume the build with the command
[ERROR]   mvn <goals> -rf :atlas-webapp




{color:red}-1 overall{color}.  

    {color:green}+1 @author{color}.  The patch does not contain any @author tags.

Console output: https://builds.apache.org/job/PreCommit-ATLAS-Build-Test/335//console

This message is automatically generated.


======================================================================
======================================================================
    Adding comment to Jira.
======================================================================
======================================================================




======================================================================
======================================================================
    Finished build.
======================================================================
======================================================================


+ EXIT_CODE=1
+ '[' -d <https://builds.apache.org/job/PreCommit-ATLAS-Build-Test/ws/../atlas_patchprocess_6355> ']'
+ '[' -d <https://builds.apache.org/job/PreCommit-ATLAS-Build-Test/ws/atlas_patchprocess_6355> ']'
+ mv <https://builds.apache.org/job/PreCommit-ATLAS-Build-Test/ws/atlas_patchprocess_6355> <https://builds.apache.org/job/PreCommit-ATLAS-Build-Test/ws/patchprocess>
+ rm -f <https://builds.apache.org/job/PreCommit-ATLAS-Build-Test/ws/../atlas_patchprocess_6355>
+ exit 1
Build step 'Execute shell' marked build as failure
Set build name.
New build name is '#335-master-ATLAS-2624-2-Fixed-the-case-where-same-classificatio.patch'
Archiving artifacts
[Fast Archiver] Compressed 164.87 MB of artifacts by 84.4% relative to #331