git.net

[Date Prev][Date Next][Thread Prev][Thread Next][Date Index][Thread Index]

Re: Build failed in Jenkins: Ivy-tests-ubuntu » ubuntu,JDK 1.7 (latest) #360


And the ModuleDescriptorMemoryCacheTest failure must be my fault.
I'll look into it later this week or next week.

Maarten

      Van: Jaikiran Pai <jaikiran@xxxxxxxxxx>
 Aan: Ant Developers List <dev@xxxxxxxxxxxxxx> 
 Verzonden: vrijdag 24 augustus 9:02 2018
 Onderwerp: Re: Build failed in Jenkins: Ivy-tests-ubuntu » ubuntu,JDK 1.7 (latest) #360
   
More of a FYI - The URLResolverTest failures, in this list, appear to be
my fault, introduced in a commit I pushed this week. I will take a look
tonight to see what the issue there is and fix (or rollback) my changes.

-Jaikiran


On 24/08/18 12:22 PM, Apache Jenkins Server wrote:
> See <https://builds.apache.org/job/Ivy-tests-ubuntu/OS=ubuntu,jdk=JDK%201.7%20(latest)/360/display/redirect?page=changes>
>
> Changes:
>
> [maartenc] FIX: ModuleDescriptorMemoryCache didn't detect outdated entries when Ivy
>
> ------------------------------------------
> [...truncated 32.16 KB...]
>    [junit] Tests run: 13, Failures: 0, Errors: 0, Skipped: 0, Time elapsed: 2,962 sec
>    [junit] Running org.apache.ivy.ant.IvyCleanCacheTest
>    [junit] Tests run: 5, Failures: 0, Errors: 0, Skipped: 0, Time elapsed: 1,552 sec
>    [junit] Running org.apache.ivy.ant.IvyConfigureTest
>    [junit] Tests run: 14, Failures: 0, Errors: 0, Skipped: 0, Time elapsed: 1,596 sec
>    [junit] Running org.apache.ivy.ant.IvyConvertPomTest
>    [junit] Tests run: 1, Failures: 0, Errors: 0, Skipped: 0, Time elapsed: 1,937 sec
>    [junit] Running org.apache.ivy.ant.IvyDeliverTest
>    [junit] Tests run: 15, Failures: 0, Errors: 0, Skipped: 0, Time elapsed: 4,205 sec
>    [junit] Running org.apache.ivy.ant.IvyDependencyTreeTest
>    [junit] Tests run: 7, Failures: 0, Errors: 0, Skipped: 0, Time elapsed: 2,566 sec
>    [junit] Running org.apache.ivy.ant.IvyDependencyUpdateCheckerTest
>    [junit] Tests run: 14, Failures: 0, Errors: 0, Skipped: 0, Time elapsed: 2,926 sec
>    [junit] Running org.apache.ivy.ant.IvyFindRevisionTest
>    [junit] Tests run: 3, Failures: 0, Errors: 0, Skipped: 0, Time elapsed: 1,868 sec
>    [junit] Running org.apache.ivy.ant.IvyInfoRepositoryTest
>    [junit] Tests run: 3, Failures: 0, Errors: 0, Skipped: 0, Time elapsed: 1,778 sec
>    [junit] Running org.apache.ivy.ant.IvyInfoTest
>    [junit] Tests run: 4, Failures: 0, Errors: 0, Skipped: 0, Time elapsed: 1,749 sec
>    [junit] Running org.apache.ivy.ant.IvyInstallTest
>    [junit] Tests run: 15, Failures: 0, Errors: 0, Skipped: 0, Time elapsed: 3,384 sec
>    [junit] Running org.apache.ivy.ant.IvyListModulesTest
>    [junit] Tests run: 2, Failures: 0, Errors: 0, Skipped: 0, Time elapsed: 1,618 sec
>    [junit] Running org.apache.ivy.ant.IvyPostResolveTaskTest
>    [junit] Tests run: 13, Failures: 0, Errors: 0, Skipped: 0, Time elapsed: 2,92 sec
>    [junit] Running org.apache.ivy.ant.IvyPublishTest
>    [junit] Tests run: 22, Failures: 0, Errors: 0, Skipped: 0, Time elapsed: 4,851 sec
>    [junit] Running org.apache.ivy.ant.IvyReportTest
>    [junit] Tests run: 6, Failures: 0, Errors: 0, Skipped: 0, Time elapsed: 3,306 sec
>    [junit] Running org.apache.ivy.ant.IvyRepositoryReportTest
>    [junit] Tests run: 3, Failures: 0, Errors: 0, Skipped: 0, Time elapsed: 2,284 sec
>    [junit] Running org.apache.ivy.ant.IvyResolveTest
>    [junit] Tests run: 35, Failures: 0, Errors: 0, Skipped: 1, Time elapsed: 4,11 sec
>    [junit] Running org.apache.ivy.ant.IvyResourcesTest
>    [junit] Tests run: 8, Failures: 0, Errors: 0, Skipped: 0, Time elapsed: 2,492 sec
>    [junit] Running org.apache.ivy.ant.IvyRetrieveBuildFileTest
>    [junit] Tests run: 1, Failures: 0, Errors: 0, Skipped: 0, Time elapsed: 2,295 sec
>    [junit] Running org.apache.ivy.ant.IvyRetrieveTest
>    [junit] Tests run: 19, Failures: 0, Errors: 0, Skipped: 0, Time elapsed: 3,52 sec
>    [junit] Running org.apache.ivy.ant.IvyTaskTest
>    [junit] Tests run: 3, Failures: 0, Errors: 0, Skipped: 0, Time elapsed: 1,524 sec
>    [junit] Running org.apache.ivy.ant.IvyVarTest
>    [junit] Tests run: 4, Failures: 0, Errors: 0, Skipped: 0, Time elapsed: 1,602 sec
>    [junit] Running org.apache.ivy.core.NormalRelativeUrlResolverTest
>    [junit] Tests run: 7, Failures: 0, Errors: 0, Skipped: 0, Time elapsed: 0,324 sec
>    [junit] Running org.apache.ivy.core.cache.DefaultRepositoryCacheManagerTest
>    [junit] Tests run: 4, Failures: 0, Errors: 0, Skipped: 1, Time elapsed: 1,011 sec
>    [junit] Running org.apache.ivy.core.cache.ModuleDescriptorMemoryCacheTest
>    [junit] Tests run: 10, Failures: 0, Errors: 4, Skipped: 0, Time elapsed: 1,004 sec
>    [junit] Test org.apache.ivy.core.cache.ModuleDescriptorMemoryCacheTest FAILED
>    [junit] Running org.apache.ivy.core.deliver.DeliverTest
>    [junit] Tests run: 1, Failures: 0, Errors: 0, Skipped: 0, Time elapsed: 2,105 sec
>    [junit] Running org.apache.ivy.core.event.IvyEventFilterTest
>    [junit] Tests run: 5, Failures: 0, Errors: 0, Skipped: 0, Time elapsed: 0,922 sec
>    [junit] Running org.apache.ivy.core.install.InstallTest
>    [junit] Tests run: 10, Failures: 0, Errors: 0, Skipped: 0, Time elapsed: 2,83 sec
>    [junit] Running org.apache.ivy.core.module.descriptor.DefaultDependencyDescriptorTest
>    [junit] Tests run: 2, Failures: 0, Errors: 0, Skipped: 0, Time elapsed: 0,134 sec
>    [junit] Running org.apache.ivy.core.module.descriptor.IvyMakePomTest
>    [junit] Tests run: 1, Failures: 0, Errors: 0, Skipped: 0, Time elapsed: 1,595 sec
>    [junit] Running org.apache.ivy.core.module.id.ModuleIdTest
>    [junit] Tests run: 11, Failures: 0, Errors: 0, Skipped: 0, Time elapsed: 0,112 sec
>    [junit] Running org.apache.ivy.core.module.id.ModuleRevisionIdTest
>    [junit] Tests run: 6, Failures: 0, Errors: 0, Skipped: 0, Time elapsed: 0,139 sec
>    [junit] Running org.apache.ivy.core.module.id.ModuleRulesTest
>    [junit] Tests run: 2, Failures: 0, Errors: 0, Skipped: 0, Time elapsed: 0,142 sec
>    [junit] Running org.apache.ivy.core.publish.PublishEngineTest
>    [junit] Tests run: 1, Failures: 0, Errors: 0, Skipped: 0, Time elapsed: 1,077 sec
>    [junit] Running org.apache.ivy.core.publish.PublishEventsTest
>    [junit] Tests run: 4, Failures: 0, Errors: 0, Skipped: 0, Time elapsed: 0,954 sec
>    [junit] Running org.apache.ivy.core.report.ResolveReportTest
>    [junit] Tests run: 6, Failures: 0, Errors: 0, Skipped: 0, Time elapsed: 1,7 sec
>    [junit] Running org.apache.ivy.core.repository.RepositoryManagementEngineTest
>    [junit] Tests run: 2, Failures: 0, Errors: 0, Skipped: 0, Time elapsed: 2,149 sec
>    [junit] Running org.apache.ivy.core.resolve.ResolveEngineTest
>    [junit] Tests run: 2, Failures: 0, Errors: 0, Skipped: 0, Time elapsed: 1,092 sec
>    [junit] Running org.apache.ivy.core.resolve.ResolveTest
>    [junit] Tests run: 238, Failures: 0, Errors: 0, Skipped: 0, Time elapsed: 14,97 sec
>    [junit] Running org.apache.ivy.core.retrieve.RetrieveTest
>    [junit] Tests run: 13, Failures: 0, Errors: 0, Skipped: 0, Time elapsed: 2,25 sec
>    [junit] Running org.apache.ivy.core.search.SearchTest
>    [junit] Tests run: 3, Failures: 0, Errors: 0, Skipped: 0, Time elapsed: 0,881 sec
>    [junit] Running org.apache.ivy.core.settings.ConfigureTest
>    [junit] Tests run: 4, Failures: 0, Errors: 0, Skipped: 0, Time elapsed: 0,934 sec
>    [junit] Running org.apache.ivy.core.settings.IvySettingsTest
>    [junit] Tests run: 2, Failures: 0, Errors: 0, Skipped: 0, Time elapsed: 0,986 sec
>    [junit] Running org.apache.ivy.core.settings.OnlineXmlSettingsParserTest
>    [junit] Tests run: 4, Failures: 0, Errors: 0, Skipped: 0, Time elapsed: 5,086 sec
>    [junit] Running org.apache.ivy.core.settings.XmlSettingsParserTest
>    [junit] Tests run: 29, Failures: 0, Errors: 0, Skipped: 0, Time elapsed: 1,248 sec
>    [junit] Running org.apache.ivy.core.sort.SortTest
>    [junit] Tests run: 8, Failures: 0, Errors: 0, Skipped: 0, Time elapsed: 0,918 sec
>    [junit] Running org.apache.ivy.osgi.core.AggregatedOSGiResolverTest
>    [junit] Tests run: 3, Failures: 0, Errors: 0, Skipped: 0, Time elapsed: 1,625 sec
>    [junit] Running org.apache.ivy.osgi.core.ExecutionEnvironmentProfileLoaderTest
>    [junit] Tests run: 1, Failures: 0, Errors: 0, Skipped: 0, Time elapsed: 0,17 sec
>    [junit] Running org.apache.ivy.osgi.core.ManifestHeaderTest
>    [junit] Tests run: 19, Failures: 0, Errors: 0, Skipped: 0, Time elapsed: 0,216 sec
>    [junit] Running org.apache.ivy.osgi.core.ManifestParserTest
>    [junit] Tests run: 3, Failures: 0, Errors: 0, Skipped: 0, Time elapsed: 0,183 sec
>    [junit] Running org.apache.ivy.osgi.core.OSGiManifestParserTest
>    [junit] Tests run: 2, Failures: 0, Errors: 0, Skipped: 0, Time elapsed: 0,877 sec
>    [junit] Running org.apache.ivy.osgi.core.OsgiLatestStrategyTest
>    [junit] Tests run: 3, Failures: 0, Errors: 0, Skipped: 0, Time elapsed: 0,862 sec
>    [junit] Running org.apache.ivy.osgi.filter.OSGiFilterTest
>    [junit] Tests run: 4, Failures: 0, Errors: 0, Skipped: 0, Time elapsed: 0,096 sec
>    [junit] Running org.apache.ivy.osgi.obr.OBRParserTest
>    [junit] Tests run: 2, Failures: 0, Errors: 0, Skipped: 0, Time elapsed: 4,819 sec
>    [junit] Running org.apache.ivy.osgi.obr.OBRResolverTest
>    [junit] Tests run: 16, Failures: 0, Errors: 0, Skipped: 0, Time elapsed: 1,602 sec
>    [junit] Running org.apache.ivy.osgi.obr.OBRXMLWriterTest
>    [junit] Tests run: 1, Failures: 0, Errors: 0, Skipped: 0, Time elapsed: 1,044 sec
>    [junit] Running org.apache.ivy.osgi.p2.P2DescriptorTest
>    [junit] Tests run: 4, Failures: 0, Errors: 0, Skipped: 0, Time elapsed: 1,229 sec
>    [junit] Running org.apache.ivy.osgi.repo.BundleRepoTest
>    [junit] Tests run: 4, Failures: 0, Errors: 0, Skipped: 0, Time elapsed: 2,285 sec
>    [junit] Running org.apache.ivy.osgi.updatesite.UpdateSiteAndIbiblioResolverTest
>    [junit] Tests run: 1, Failures: 0, Errors: 0, Skipped: 0, Time elapsed: 1,736 sec
>    [junit] Running org.apache.ivy.osgi.updatesite.UpdateSiteLoaderTest
>    [junit] Tests run: 4, Failures: 0, Errors: 0, Skipped: 1, Time elapsed: 41,911 sec
>    [junit] Running org.apache.ivy.osgi.updatesite.UpdateSiteResolverTest
>    [junit] Tests run: 3, Failures: 0, Errors: 0, Skipped: 0, Time elapsed: 1,331 sec
>    [junit] Running org.apache.ivy.osgi.util.ParseUtilTest
>    [junit] Tests run: 1, Failures: 0, Errors: 0, Skipped: 0, Time elapsed: 0,094 sec
>    [junit] Running org.apache.ivy.osgi.util.VersionRangeTest
>    [junit] Tests run: 2, Failures: 0, Errors: 0, Skipped: 0, Time elapsed: 0,114 sec
>    [junit] Running org.apache.ivy.osgi.util.VersionTest
>    [junit] Tests run: 2, Failures: 0, Errors: 0, Skipped: 0, Time elapsed: 0,112 sec
>    [junit] Running org.apache.ivy.plugins.circular.IgnoreCircularDependencyStrategyTest
>    [junit] Tests run: 2, Failures: 0, Errors: 0, Skipped: 0, Time elapsed: 0,865 sec
>    [junit] Running org.apache.ivy.plugins.circular.WarnCircularDependencyStrategyTest
>    [junit] Tests run: 3, Failures: 0, Errors: 0, Skipped: 0, Time elapsed: 0,932 sec
>    [junit] Running org.apache.ivy.plugins.conflict.LatestCompatibleConflictManagerTest
>    [junit] Tests run: 12, Failures: 0, Errors: 0, Skipped: 0, Time elapsed: 3,457 sec
>    [junit] Running org.apache.ivy.plugins.conflict.LatestConflictManagerTest
>    [junit] Tests run: 6, Failures: 0, Errors: 0, Skipped: 0, Time elapsed: 1,722 sec
>    [junit] Running org.apache.ivy.plugins.conflict.RegexpConflictManagerTest
>    [junit] Tests run: 2, Failures: 0, Errors: 0, Skipped: 0, Time elapsed: 1,17 sec
>    [junit] Running org.apache.ivy.plugins.conflict.StrictConflictManagerTest
>    [junit] Tests run: 5, Failures: 0, Errors: 0, Skipped: 0, Time elapsed: 1,389 sec
>    [junit] Running org.apache.ivy.plugins.latest.LatestRevisionStrategyTest
>    [junit] Tests run: 4, Failures: 0, Errors: 0, Skipped: 0, Time elapsed: 0,992 sec
>    [junit] Running org.apache.ivy.plugins.lock.ArtifactLockStrategyTest
>    [junit] Tests run: 1, Failures: 0, Errors: 0, Skipped: 0, Time elapsed: 5,915 sec
>    [junit] Running org.apache.ivy.plugins.matcher.ExactOrRegexpPatternMatcherTest
>    [junit] Tests run: 7, Failures: 0, Errors: 0, Skipped: 0, Time elapsed: 0,473 sec
>    [junit] Running org.apache.ivy.plugins.matcher.ExactPatternMatcherTest
>    [junit] Tests run: 7, Failures: 0, Errors: 0, Skipped: 0, Time elapsed: 0,202 sec
>    [junit] Running org.apache.ivy.plugins.matcher.GlobPatternMatcherTest
>    [junit] Tests run: 13, Failures: 0, Errors: 0, Skipped: 0, Time elapsed: 0,895 sec
>    [junit] Running org.apache.ivy.plugins.matcher.RegexpPatternMatcherTest
>    [junit] Tests run: 7, Failures: 0, Errors: 0, Skipped: 0, Time elapsed: 0,449 sec
>    [junit] Running org.apache.ivy.plugins.namespace.MRIDTransformationRuleTest
>    [junit] Tests run: 1, Failures: 0, Errors: 0, Skipped: 0, Time elapsed: 0,178 sec
>    [junit] Running org.apache.ivy.plugins.namespace.NameSpaceHelperTest
>    [junit] Tests run: 1, Failures: 0, Errors: 0, Skipped: 0, Time elapsed: 0,187 sec
>    [junit] Running org.apache.ivy.plugins.parser.ModuleDescriptorParserRegistryTest
>    [junit] Tests run: 1, Failures: 0, Errors: 0, Skipped: 0, Time elapsed: 1,01 sec
>    [junit] Running org.apache.ivy.plugins.parser.m2.MavenVersionRangeParserTest
>    [junit] Tests run: 8, Failures: 0, Errors: 0, Skipped: 0, Time elapsed: 0,123 sec
>    [junit] Running org.apache.ivy.plugins.parser.m2.PomModuleDescriptorParserTest
>    [junit] Tests run: 46, Failures: 0, Errors: 0, Skipped: 0, Time elapsed: 1,864 sec
>    [junit] Running org.apache.ivy.plugins.parser.m2.PomModuleDescriptorWriterTest
>    [junit] Tests run: 12, Failures: 0, Errors: 0, Skipped: 0, Time elapsed: 1,285 sec
>    [junit] Running org.apache.ivy.plugins.parser.xml.XmlModuleDescriptorParserTest
>    [junit] Tests run: 44, Failures: 0, Errors: 0, Skipped: 0, Time elapsed: 1,786 sec
>    [junit] Running org.apache.ivy.plugins.parser.xml.XmlModuleDescriptorWriterTest
>    [junit] Tests run: 10, Failures: 0, Errors: 0, Skipped: 0, Time elapsed: 1,359 sec
>    [junit] Running org.apache.ivy.plugins.parser.xml.XmlModuleUpdaterTest
>    [junit] Tests run: 14, Failures: 0, Errors: 0, Skipped: 0, Time elapsed: 1,497 sec
>    [junit] Running org.apache.ivy.plugins.report.XmlReportParserTest
>    [junit] Tests run: 1, Failures: 0, Errors: 0, Skipped: 0, Time elapsed: 1,149 sec
>    [junit] Running org.apache.ivy.plugins.report.XmlReportWriterTest
>    [junit] Tests run: 3, Failures: 0, Errors: 0, Skipped: 0, Time elapsed: 1,389 sec
>    [junit] Running org.apache.ivy.plugins.repository.vfs.VfsRepositoryTest
>    [junit] Tests run: 7, Failures: 0, Errors: 0, Skipped: 0, Time elapsed: 1,291 sec
>    [junit] Running org.apache.ivy.plugins.repository.vfs.VfsResourceTest
>    [junit] Tests run: 6, Failures: 0, Errors: 0, Skipped: 0, Time elapsed: 1,186 sec
>    [junit] Running org.apache.ivy.plugins.resolver.BintrayResolverTest
>    [junit] Tests run: 12, Failures: 0, Errors: 0, Skipped: 0, Time elapsed: 3,363 sec
>    [junit] Running org.apache.ivy.plugins.resolver.ChainResolverTest
>    [junit] Tests run: 15, Failures: 0, Errors: 0, Skipped: 0, Time elapsed: 1,291 sec
>    [junit] Running org.apache.ivy.plugins.resolver.DualResolverTest
>    [junit] Tests run: 6, Failures: 0, Errors: 0, Skipped: 0, Time elapsed: 0,833 sec
>    [junit] Running org.apache.ivy.plugins.resolver.FileSystemResolverTest
>    [junit] Tests run: 27, Failures: 0, Errors: 0, Skipped: 0, Time elapsed: 1,734 sec
>    [junit] Running org.apache.ivy.plugins.resolver.IBiblioMavenSnapshotsResolutionTest
>    [junit] Tests run: 1, Failures: 0, Errors: 0, Skipped: 0, Time elapsed: 1,476 sec
>    [junit] Running org.apache.ivy.plugins.resolver.IBiblioResolverTest
>    [junit] Tests run: 4, Failures: 0, Errors: 0, Skipped: 0, Time elapsed: 1,987 sec
>    [junit] Running org.apache.ivy.plugins.resolver.IvyRepResolverTest
>    [junit] Tests run: 3, Failures: 0, Errors: 0, Skipped: 0, Time elapsed: 1,132 sec
>    [junit] Running org.apache.ivy.plugins.resolver.JarResolverTest
>    [junit] Tests run: 3, Failures: 0, Errors: 0, Skipped: 0, Time elapsed: 1,166 sec
>    [junit] Running org.apache.ivy.plugins.resolver.Maven2LocalTest
>    [junit] Tests run: 2, Failures: 0, Errors: 0, Skipped: 0, Time elapsed: 0,942 sec
>    [junit] Running org.apache.ivy.plugins.resolver.MirroredURLResolverTest
>    [junit] Tests run: 3, Failures: 0, Errors: 0, Skipped: 0, Time elapsed: 1,564 sec
>    [junit] Running org.apache.ivy.plugins.resolver.PackagerResolverTest
>    [junit] Tests run: 3, Failures: 0, Errors: 0, Skipped: 0, Time elapsed: 3,314 sec
>    [junit] Running org.apache.ivy.plugins.resolver.URLResolverTest
>    [junit] Tests run: 5, Failures: 0, Errors: 1, Skipped: 0, Time elapsed: 2,044 sec
>    [junit] Test org.apache.ivy.plugins.resolver.URLResolverTest FAILED
>    [junit] Running org.apache.ivy.plugins.resolver.VfsResolverTest
>    [junit] Tests run: 2, Failures: 0, Errors: 0, Skipped: 0, Time elapsed: 0,187 sec
>    [junit] Running org.apache.ivy.plugins.resolver.util.ResolverHelperTest
>    [junit] Tests run: 1, Failures: 0, Errors: 0, Skipped: 0, Time elapsed: 0,189 sec
>    [junit] Running org.apache.ivy.plugins.trigger.LogTriggerTest
>    [junit] Tests run: 3, Failures: 0, Errors: 0, Skipped: 0, Time elapsed: 0,99 sec
>    [junit] Running org.apache.ivy.plugins.version.LatestVersionMatcherTest
>    [junit] Tests run: 5, Failures: 0, Errors: 0, Skipped: 0, Time elapsed: 1,109 sec
>    [junit] Running org.apache.ivy.plugins.version.MavenTimedSnapshotVersionMatcherTest
>    [junit] Tests run: 2, Failures: 0, Errors: 0, Skipped: 0, Time elapsed: 0,145 sec
>    [junit] Running org.apache.ivy.plugins.version.PatternVersionMatcherTest
>    [junit] Tests run: 3, Failures: 0, Errors: 0, Skipped: 0, Time elapsed: 0,901 sec
>    [junit] Running org.apache.ivy.plugins.version.VersionRangeMatcherTest
>    [junit] Tests run: 6, Failures: 0, Errors: 0, Skipped: 0, Time elapsed: 0,899 sec
>    [junit] Running org.apache.ivy.util.ConfiguratorTest
>    [junit] Tests run: 13, Failures: 0, Errors: 0, Skipped: 0, Time elapsed: 0,17 sec
>    [junit] Running org.apache.ivy.util.IvyPatternHelperTest
>    [junit] Tests run: 7, Failures: 0, Errors: 0, Skipped: 0, Time elapsed: 0,122 sec
>    [junit] Running org.apache.ivy.util.StringUtilsTest
>    [junit] Tests run: 2, Failures: 0, Errors: 0, Skipped: 0, Time elapsed: 0,103 sec
>    [junit] Running org.apache.ivy.util.url.ApacheURLListerTest
>    [junit] Tests run: 6, Failures: 0, Errors: 0, Skipped: 0, Time elapsed: 0,374 sec
>    [junit] Running org.apache.ivy.util.url.ArtifactoryListingTest
>    [junit] Tests run: 1, Failures: 0, Errors: 0, Skipped: 0, Time elapsed: 0,642 sec
>    [junit] Running org.apache.ivy.util.url.BasicURLHandlerTest
>    [junit] Tests run: 2, Failures: 0, Errors: 0, Skipped: 0, Time elapsed: 12,402 sec
>    [junit] Running org.apache.ivy.util.url.HttpclientURLHandlerTest
>    [junit] Tests run: 4, Failures: 0, Errors: 0, Skipped: 0, Time elapsed: 3,719 sec
>    [junit] Running org.apache.ivy.util.url.IvyAuthenticatorTest
>    [junit] Tests run: 1, Failures: 0, Errors: 0, Skipped: 0, Time elapsed: 0,114 sec
>
> test-report:
> [junitreport] Processing <https://builds.apache.org/job/Ivy-tests-ubuntu/OS=ubuntu,jdk=JDK%201.7%20(latest)/ws/build/reports/test/xml/TESTS-TestSuites.xml> to /tmp/null2029476896
> [junitreport] Loading stylesheet jar:file:/home/jenkins/tools/ant/latest1.9/lib/ant-junit.jar!/org/apache/tools/ant/taskdefs/optional/junit/xsl/junit-frames.xsl
> [junitreport] Transform time: 2031ms
> [junitreport] Deleting: /tmp/null2029476896
>    [mkdir] Created dir: <https://builds.apache.org/job/Ivy-tests-ubuntu/OS=ubuntu,jdk=JDK%201.7%20(latest)/ws/build/reports/coverage>
> [jacoco:report] Loading execution data file <https://builds.apache.org/job/Ivy-tests-ubuntu/OS=ubuntu,jdk=JDK%201.7%20(latest)/ws/build/jacoco.data>
> [jacoco:report] Writing bundle 'Ivy' with 684 classes
>
> BUILD FAILED
> <https://builds.apache.org/job/Ivy-tests-ubuntu/OS=ubuntu,jdk=JDK%201.7%20(latest)/ws/build.xml>:496: At least one test has failed. See logs (in <https://builds.apache.org/job/Ivy-tests-ubuntu/OS=ubuntu,jdk=JDK%201.7%20(latest)/ws/build/reports/test/xml)> or report (in <https://builds.apache.org/job/Ivy-tests-ubuntu/OS=ubuntu,jdk=JDK%201.7%20(latest)/ws/build/reports/test/html)>
>
> Total time: 6 minutes 58 seconds
> Build step 'Invoke Ant' marked build as failure
> Recording test results


---------------------------------------------------------------------
To unsubscribe, e-mail: dev-unsubscribe@xxxxxxxxxxxxxx
For additional commands, e-mail: dev-help@xxxxxxxxxxxxxx